W3C home > Mailing lists > Public > www-dom-ts@w3.org > November 2001

Crimson 1.1.3 tests

From: Curt Arnold <carnold@houston.rr.com>
Date: Wed, 14 Nov 2001 04:06:06 -0600
Message-ID: <001a01c16cf3$f9ca6c10$7600a8c0@CurtMicron>
To: <www-dom-ts@w3.org>
Cc: "Edwin Goei" <edwingo@sun.com>
entitygetpublicid, notationgetsystemid

These tests have been a subject of debate repeatedly on the www-dom-ts
mailing list.  Crimson alone of the tested processors changes the relative
URI's in the source document to absolute URI's when retrieved by
Entity.getPublicId() and similar.  While not expressly prohibited by the DOM
spec, there is nothing that would suggest to the user that it should be
anticipated.

Edwin, it would be interesting to get your take on whether the returning
absolute URI's was intentional and any thought process behind it.

Tests *EE tests and documentcreateentitydefault

Entity content not added when entity reference is created in both entity
expanding and entity preserving modes

elementreplaceattributewithitself

Fails here too but throws WRONG_DOCUMENT_ERR


Implementation title:org.apache.crimson.tree
Implementation vendor:Apache Software Foundation
Implementation version:1.1.3

isCoalescing() == false
isExpandEntityReferences() == false
isIgnoringComments() == false
isIgnoringElementContentWhitespace() == false
isNamespaceAware() == false
isValidating() == false
.............E.........E.......E............
......E.......E..E...........E..F.............
..............................E..E..E.......
E...E...F...........................F........
.........................................
................F.........................
F.........F...E........F...........E..........
...
Time: 3.425
There were 14 errors:
1)
http://www.w3.org/2001/DOM-Test-Suite/level1/core/attrsetvaluenomodification
allowederrEE(org.w3c.domts.JUnitTestCaseAdapter)
java.lang.NullPointerException
at
org.w3c.domts.level1.core.attrsetvaluenomodificationallowederrEE.runTest(Unk
nown Source)
at org.w3c.domts.JUnitTestCaseAdapter.runTest(Unknown Source)
at org.w3c.domts.JUnitRunner.runTest(Unknown Source)
at org.w3c.domts.JUnitRunner.execute(Unknown Source)
at org.w3c.domts.DOMTestCase.doMain(Unknown Source)
at org.w3c.domts.level1.core.alltests.main(Unknown Source)
2)
http://www.w3.org/2001/DOM-Test-Suite/level1/core/characterdataappenddatanom
odificationallowederrEE(org.w3c.domts.JUnitTestCaseAdapter)
java.lang.NullPointerException
at
org.w3c.domts.level1.core.characterdataappenddatanomodificationallowederrEE.
runTest(Unknown Source)
at org.w3c.domts.JUnitTestCaseAdapter.runTest(Unknown Source)
at org.w3c.domts.JUnitRunner.runTest(Unknown Source)
at org.w3c.domts.JUnitRunner.execute(Unknown Source)
at org.w3c.domts.DOMTestCase.doMain(Unknown Source)
at org.w3c.domts.level1.core.alltests.main(Unknown Source)
3)
http://www.w3.org/2001/DOM-Test-Suite/level1/core/characterdatadeletedatanom
odificationallowederrEE(org.w3c.domts.JUnitTestCaseAdapter)
java.lang.NullPointerException
at
org.w3c.domts.level1.core.characterdatadeletedatanomodificationallowederrEE.
runTest(Unknown Source)
at org.w3c.domts.JUnitTestCaseAdapter.runTest(Unknown Source)
at org.w3c.domts.JUnitRunner.runTest(Unknown Source)
at org.w3c.domts.JUnitRunner.execute(Unknown Source)
at org.w3c.domts.DOMTestCase.doMain(Unknown Source)
at org.w3c.domts.level1.core.alltests.main(Unknown Source)
4)
http://www.w3.org/2001/DOM-Test-Suite/level1/core/characterdatainsertdatanom
odificationallowederrEE(org.w3c.domts.JUnitTestCaseAdapter)
java.lang.NullPointerException
at
org.w3c.domts.level1.core.characterdatainsertdatanomodificationallowederrEE.
runTest(Unknown Source)
at org.w3c.domts.JUnitTestCaseAdapter.runTest(Unknown Source)
at org.w3c.domts.JUnitRunner.runTest(Unknown Source)
at org.w3c.domts.JUnitRunner.execute(Unknown Source)
at org.w3c.domts.DOMTestCase.doMain(Unknown Source)
at org.w3c.domts.level1.core.alltests.main(Unknown Source)
5)
http://www.w3.org/2001/DOM-Test-Suite/level1/core/characterdatareplacedatano
modificationallowederrEE(org.w3c.domts.JUnitTestCaseAdapter)
java.lang.NullPointerException
at
org.w3c.domts.level1.core.characterdatareplacedatanomodificationallowederrEE
.runTest(Unknown Source)
at org.w3c.domts.JUnitTestCaseAdapter.runTest(Unknown Source)
at org.w3c.domts.JUnitRunner.runTest(Unknown Source)
at org.w3c.domts.JUnitRunner.execute(Unknown Source)
at org.w3c.domts.DOMTestCase.doMain(Unknown Source)
at org.w3c.domts.level1.core.alltests.main(Unknown Source)
6)
http://www.w3.org/2001/DOM-Test-Suite/level1/core/characterdatasetdatanomodi
ficationallowederrEE(org.w3c.domts.JUnitTestCaseAdapter)
java.lang.NullPointerException
at
org.w3c.domts.level1.core.characterdatasetdatanomodificationallowederrEE.run
Test(Unknown Source)
at org.w3c.domts.JUnitTestCaseAdapter.runTest(Unknown Source)
at org.w3c.domts.JUnitRunner.runTest(Unknown Source)
at org.w3c.domts.JUnitRunner.execute(Unknown Source)
at org.w3c.domts.DOMTestCase.doMain(Unknown Source)
at org.w3c.domts.level1.core.alltests.main(Unknown Source)
7)
http://www.w3.org/2001/DOM-Test-Suite/level1/core/documentcreateelementdefau
ltattr(org.w3c.domts.JUnitTestCaseAdapter)
java.lang.NullPointerException
at
org.w3c.domts.level1.core.documentcreateelementdefaultattr.runTest(Unknown
Source)
at org.w3c.domts.JUnitTestCaseAdapter.runTest(Unknown Source)
at org.w3c.domts.JUnitRunner.runTest(Unknown Source)
at org.w3c.domts.JUnitRunner.execute(Unknown Source)
at org.w3c.domts.DOMTestCase.doMain(Unknown Source)
at org.w3c.domts.level1.core.alltests.main(Unknown Source)
8)
http://www.w3.org/2001/DOM-Test-Suite/level1/core/elementremoveattributenode
nomodificationallowederrEE(org.w3c.domts.JUnitTestCaseAdapter)
java.lang.NullPointerException
at
org.w3c.domts.level1.core.elementremoveattributenodenomodificationallowederr
EE.runTest(Unknown Source)
at org.w3c.domts.JUnitTestCaseAdapter.runTest(Unknown Source)
at org.w3c.domts.JUnitRunner.runTest(Unknown Source)
at org.w3c.domts.JUnitRunner.execute(Unknown Source)
at org.w3c.domts.DOMTestCase.doMain(Unknown Source)
at org.w3c.domts.level1.core.alltests.main(Unknown Source)
9)
http://www.w3.org/2001/DOM-Test-Suite/level1/core/elementremoveattributenomo
dificationallowederrEE(org.w3c.domts.JUnitTestCaseAdapter)
java.lang.NullPointerException
at
org.w3c.domts.level1.core.elementremoveattributenomodificationallowederrEE.r
unTest(Unknown Source)
at org.w3c.domts.JUnitTestCaseAdapter.runTest(Unknown Source)
at org.w3c.domts.JUnitRunner.runTest(Unknown Source)
at org.w3c.domts.JUnitRunner.execute(Unknown Source)
at org.w3c.domts.DOMTestCase.doMain(Unknown Source)
at org.w3c.domts.level1.core.alltests.main(Unknown Source)
10)
http://www.w3.org/2001/DOM-Test-Suite/level1/core/elementreplaceattributewit
hself(org.w3c.domts.JUnitTestCaseAdapter)
org.apache.crimson.tree.DomEx: WRONG_DOCUMENT_ERR: That node doesn't belong
in this document.
at org.apache.crimson.tree.AttributeSet.setNamedItem(AttributeSet.java:432)
at
org.apache.crimson.tree.ElementNode2.setAttributeNode(ElementNode2.java:572)
at org.w3c.domts.level1.core.elementreplaceattributewithself.runTest(Unknown
Source)
at org.w3c.domts.JUnitTestCaseAdapter.runTest(Unknown Source)
at org.w3c.domts.JUnitRunner.runTest(Unknown Source)
at org.w3c.domts.JUnitRunner.execute(Unknown Source)
at org.w3c.domts.DOMTestCase.doMain(Unknown Source)
at org.w3c.domts.level1.core.alltests.main(Unknown Source)
11)
http://www.w3.org/2001/DOM-Test-Suite/level1/core/elementsetattributenodenom
odificationallowederrEE(org.w3c.domts.JUnitTestCaseAdapter)
java.lang.NullPointerException
at
org.w3c.domts.level1.core.elementsetattributenodenomodificationallowederrEE.
runTest(Unknown Source)
at org.w3c.domts.JUnitTestCaseAdapter.runTest(Unknown Source)
at org.w3c.domts.JUnitRunner.runTest(Unknown Source)
at org.w3c.domts.JUnitRunner.execute(Unknown Source)
at org.w3c.domts.DOMTestCase.doMain(Unknown Source)
at org.w3c.domts.level1.core.alltests.main(Unknown Source)
12)
http://www.w3.org/2001/DOM-Test-Suite/level1/core/elementsetattributenomodif
icationallowederrEE(org.w3c.domts.JUnitTestCaseAdapter)
java.lang.NullPointerException
at
org.w3c.domts.level1.core.elementsetattributenomodificationallowederrEE.runT
est(Unknown Source)
at org.w3c.domts.JUnitTestCaseAdapter.runTest(Unknown Source)
at org.w3c.domts.JUnitRunner.runTest(Unknown Source)
at org.w3c.domts.JUnitRunner.execute(Unknown Source)
at org.w3c.domts.DOMTestCase.doMain(Unknown Source)
at org.w3c.domts.level1.core.alltests.main(Unknown Source)
13)
http://www.w3.org/2001/DOM-Test-Suite/level1/core/nodesetnodevaluenomodifica
tionallowederrEE(org.w3c.domts.JUnitTestCaseAdapter)
java.lang.NullPointerException
at
org.w3c.domts.level1.core.nodesetnodevaluenomodificationallowederrEE.runTest
(Unknown Source)
at org.w3c.domts.JUnitTestCaseAdapter.runTest(Unknown Source)
at org.w3c.domts.JUnitRunner.runTest(Unknown Source)
at org.w3c.domts.JUnitRunner.execute(Unknown Source)
at org.w3c.domts.DOMTestCase.doMain(Unknown Source)
at org.w3c.domts.level1.core.alltests.main(Unknown Source)
14)
http://www.w3.org/2001/DOM-Test-Suite/level1/core/textsplittextnomodificatio
nallowederrEE(org.w3c.domts.JUnitTestCaseAdapter)
java.lang.NullPointerException
at
org.w3c.domts.level1.core.textsplittextnomodificationallowederrEE.runTest(Un
known Source)
at org.w3c.domts.JUnitTestCaseAdapter.runTest(Unknown Source)
at org.w3c.domts.JUnitRunner.runTest(Unknown Source)
at org.w3c.domts.JUnitRunner.execute(Unknown Source)
at org.w3c.domts.DOMTestCase.doMain(Unknown Source)
at org.w3c.domts.level1.core.alltests.main(Unknown Source)
There were 7 failures:
1)
http://www.w3.org/2001/DOM-Test-Suite/level1/core/documentcreateentityrefere
nceknown(org.w3c.domts.JUnitTestCaseAdapter)junit.framework.AssertionFailedE
rror: size expected:<1> but was:<0>
at org.w3c.domts.JUnitTestCaseAdapter.assertSize(Unknown Source)
at org.w3c.domts.DOMTestCase.assertSize(Unknown Source)
at
org.w3c.domts.level1.core.documentcreateentityreferenceknown.runTest(Unknown
Source)
at org.w3c.domts.JUnitTestCaseAdapter.runTest(Unknown Source)
at org.w3c.domts.JUnitRunner.runTest(Unknown Source)
at org.w3c.domts.JUnitRunner.execute(Unknown Source)
at org.w3c.domts.DOMTestCase.doMain(Unknown Source)
at org.w3c.domts.level1.core.alltests.main(Unknown Source)
2)
http://www.w3.org/2001/DOM-Test-Suite/level1/core/entitygetpublicid(org.w3c.
domts.JUnitTestCaseAdapter)junit.framework.AssertionFailedError:
systemIdStrict expected:<entityFile> but
was:<jar:file:/D:/domts/2001/DOM-Test-Suite/dist/dom1-core.jar!/entityFile>
at org.w3c.domts.JUnitTestCaseAdapter.assertEquals(Unknown Source)
at org.w3c.domts.DOMTestCase.assertEquals(Unknown Source)
at org.w3c.domts.level1.core.entitygetpublicid.runTest(Unknown Source)
at org.w3c.domts.JUnitTestCaseAdapter.runTest(Unknown Source)
at org.w3c.domts.JUnitRunner.runTest(Unknown Source)
at org.w3c.domts.JUnitRunner.execute(Unknown Source)
at org.w3c.domts.DOMTestCase.doMain(Unknown Source)
at org.w3c.domts.level1.core.alltests.main(Unknown Source)
3)
http://www.w3.org/2001/DOM-Test-Suite/level1/core/nodeappendchildnomodificat
ionallowederrEE(org.w3c.domts.JUnitTestCaseAdapter)junit.framework.Assertion
FailedError: throw_NO_MODIFICATION_ALLOWED_ERR
at org.w3c.domts.JUnitTestCaseAdapter.assertTrue(Unknown Source)
at org.w3c.domts.DOMTestCase.assertTrue(Unknown Source)
at
org.w3c.domts.level1.core.nodeappendchildnomodificationallowederrEE.runTest(
Unknown Source)
at org.w3c.domts.JUnitTestCaseAdapter.runTest(Unknown Source)
at org.w3c.domts.JUnitRunner.runTest(Unknown Source)
at org.w3c.domts.JUnitRunner.execute(Unknown Source)
at org.w3c.domts.DOMTestCase.doMain(Unknown Source)
at org.w3c.domts.level1.core.alltests.main(Unknown Source)
4)
http://www.w3.org/2001/DOM-Test-Suite/level1/core/nodeinsertbeforenomodifica
tionallowederrEE(org.w3c.domts.JUnitTestCaseAdapter)junit.framework.Assertio
nFailedError: nodeInsertBeforeNoModificationAllowedErrAssert
at org.w3c.domts.JUnitTestCaseAdapter.assertTrue(Unknown Source)
at org.w3c.domts.DOMTestCase.assertTrue(Unknown Source)
at
org.w3c.domts.level1.core.nodeinsertbeforenomodificationallowederrEE.runTest
(Unknown Source)
at org.w3c.domts.JUnitTestCaseAdapter.runTest(Unknown Source)
at org.w3c.domts.JUnitRunner.runTest(Unknown Source)
at org.w3c.domts.JUnitRunner.execute(Unknown Source)
at org.w3c.domts.DOMTestCase.doMain(Unknown Source)
at org.w3c.domts.level1.core.alltests.main(Unknown Source)
5)
http://www.w3.org/2001/DOM-Test-Suite/level1/core/noderemovechildnomodificat
ionallowederrEE(org.w3c.domts.JUnitTestCaseAdapter)junit.framework.Assertion
FailedError: throw_NO_MODIFICATION_ALLOWED_ERR
at org.w3c.domts.JUnitTestCaseAdapter.assertTrue(Unknown Source)
at org.w3c.domts.DOMTestCase.assertTrue(Unknown Source)
at
org.w3c.domts.level1.core.noderemovechildnomodificationallowederrEE.runTest(
Unknown Source)
at org.w3c.domts.JUnitTestCaseAdapter.runTest(Unknown Source)
at org.w3c.domts.JUnitRunner.runTest(Unknown Source)
at org.w3c.domts.JUnitRunner.execute(Unknown Source)
at org.w3c.domts.DOMTestCase.doMain(Unknown Source)
at org.w3c.domts.level1.core.alltests.main(Unknown Source)
6)
http://www.w3.org/2001/DOM-Test-Suite/level1/core/nodereplacechildnomodifica
tionallowederrEE(org.w3c.domts.JUnitTestCaseAdapter)junit.framework.Assertio
nFailedError: throw_NO_MODIFICATION_ALLOWED_ERR
at org.w3c.domts.JUnitTestCaseAdapter.assertTrue(Unknown Source)
at org.w3c.domts.DOMTestCase.assertTrue(Unknown Source)
at
org.w3c.domts.level1.core.nodereplacechildnomodificationallowederrEE.runTest
(Unknown Source)
at org.w3c.domts.JUnitTestCaseAdapter.runTest(Unknown Source)
at org.w3c.domts.JUnitRunner.runTest(Unknown Source)
at org.w3c.domts.JUnitRunner.execute(Unknown Source)
at org.w3c.domts.DOMTestCase.doMain(Unknown Source)
at org.w3c.domts.level1.core.alltests.main(Unknown Source)
7)
http://www.w3.org/2001/DOM-Test-Suite/level1/core/notationgetsystemid(org.w3
c.domts.JUnitTestCaseAdapter)junit.framework.AssertionFailedError:
exactEquals expected:<notation2File> but
was:<jar:file:/D:/domts/2001/DOM-Test-Suite/dist/dom1-core.jar!/notation2Fil
e>
at org.w3c.domts.JUnitTestCaseAdapter.assertEquals(Unknown Source)
at org.w3c.domts.DOMTestCase.assertEquals(Unknown Source)
at org.w3c.domts.level1.core.notationgetsystemid.runTest(Unknown Source)
at org.w3c.domts.JUnitTestCaseAdapter.runTest(Unknown Source)
at org.w3c.domts.JUnitRunner.runTest(Unknown Source)
at org.w3c.domts.JUnitRunner.execute(Unknown Source)
at org.w3c.domts.DOMTestCase.doMain(Unknown Source)
at org.w3c.domts.level1.core.alltests.main(Unknown Source)

FAILURES!!!
Tests run: 290, Failures: 7, Errors: 14

isCoalescing() == false
isExpandEntityReferences() == true
isIgnoringComments() == false
isIgnoringElementContentWhitespace() == true
isNamespaceAware() == true
isValidating() == true
.............E.........E.......E............
......E.......E..E...........E..F.............
..............................E..E..E.......
E...E...F...........................F........
.........................................
................F.........................
F.........F...E........F.....E......E..........
...
Time: 2.524
There were 15 errors:
1)
http://www.w3.org/2001/DOM-Test-Suite/level1/core/attrsetvaluenomodification
allowederrEE(org.w3c.domts.JUnitTestCaseAdapter)
java.lang.NullPointerException
at
org.w3c.domts.level1.core.attrsetvaluenomodificationallowederrEE.runTest(Unk
nown Source)
at org.w3c.domts.JUnitTestCaseAdapter.runTest(Unknown Source)
at org.w3c.domts.JUnitRunner.runTest(Unknown Source)
at org.w3c.domts.JUnitRunner.execute(Unknown Source)
at org.w3c.domts.DOMTestCase.doMain(Unknown Source)
at org.w3c.domts.level1.core.alltests.main(Unknown Source)
2)
http://www.w3.org/2001/DOM-Test-Suite/level1/core/characterdataappenddatanom
odificationallowederrEE(org.w3c.domts.JUnitTestCaseAdapter)
java.lang.NullPointerException
at
org.w3c.domts.level1.core.characterdataappenddatanomodificationallowederrEE.
runTest(Unknown Source)
at org.w3c.domts.JUnitTestCaseAdapter.runTest(Unknown Source)
at org.w3c.domts.JUnitRunner.runTest(Unknown Source)
at org.w3c.domts.JUnitRunner.execute(Unknown Source)
at org.w3c.domts.DOMTestCase.doMain(Unknown Source)
at org.w3c.domts.level1.core.alltests.main(Unknown Source)
3)
http://www.w3.org/2001/DOM-Test-Suite/level1/core/characterdatadeletedatanom
odificationallowederrEE(org.w3c.domts.JUnitTestCaseAdapter)
java.lang.NullPointerException
at
org.w3c.domts.level1.core.characterdatadeletedatanomodificationallowederrEE.
runTest(Unknown Source)
at org.w3c.domts.JUnitTestCaseAdapter.runTest(Unknown Source)
at org.w3c.domts.JUnitRunner.runTest(Unknown Source)
at org.w3c.domts.JUnitRunner.execute(Unknown Source)
at org.w3c.domts.DOMTestCase.doMain(Unknown Source)
at org.w3c.domts.level1.core.alltests.main(Unknown Source)
4)
http://www.w3.org/2001/DOM-Test-Suite/level1/core/characterdatainsertdatanom
odificationallowederrEE(org.w3c.domts.JUnitTestCaseAdapter)
java.lang.NullPointerException
at
org.w3c.domts.level1.core.characterdatainsertdatanomodificationallowederrEE.
runTest(Unknown Source)
at org.w3c.domts.JUnitTestCaseAdapter.runTest(Unknown Source)
at org.w3c.domts.JUnitRunner.runTest(Unknown Source)
at org.w3c.domts.JUnitRunner.execute(Unknown Source)
at org.w3c.domts.DOMTestCase.doMain(Unknown Source)
at org.w3c.domts.level1.core.alltests.main(Unknown Source)
5)
http://www.w3.org/2001/DOM-Test-Suite/level1/core/characterdatareplacedatano
modificationallowederrEE(org.w3c.domts.JUnitTestCaseAdapter)
java.lang.NullPointerException
at
org.w3c.domts.level1.core.characterdatareplacedatanomodificationallowederrEE
.runTest(Unknown Source)
at org.w3c.domts.JUnitTestCaseAdapter.runTest(Unknown Source)
at org.w3c.domts.JUnitRunner.runTest(Unknown Source)
at org.w3c.domts.JUnitRunner.execute(Unknown Source)
at org.w3c.domts.DOMTestCase.doMain(Unknown Source)
at org.w3c.domts.level1.core.alltests.main(Unknown Source)
6)
http://www.w3.org/2001/DOM-Test-Suite/level1/core/characterdatasetdatanomodi
ficationallowederrEE(org.w3c.domts.JUnitTestCaseAdapter)
java.lang.NullPointerException
at
org.w3c.domts.level1.core.characterdatasetdatanomodificationallowederrEE.run
Test(Unknown Source)
at org.w3c.domts.JUnitTestCaseAdapter.runTest(Unknown Source)
at org.w3c.domts.JUnitRunner.runTest(Unknown Source)
at org.w3c.domts.JUnitRunner.execute(Unknown Source)
at org.w3c.domts.DOMTestCase.doMain(Unknown Source)
at org.w3c.domts.level1.core.alltests.main(Unknown Source)
7)
http://www.w3.org/2001/DOM-Test-Suite/level1/core/documentcreateelementdefau
ltattr(org.w3c.domts.JUnitTestCaseAdapter)
java.lang.NullPointerException
at
org.w3c.domts.level1.core.documentcreateelementdefaultattr.runTest(Unknown
Source)
at org.w3c.domts.JUnitTestCaseAdapter.runTest(Unknown Source)
at org.w3c.domts.JUnitRunner.runTest(Unknown Source)
at org.w3c.domts.JUnitRunner.execute(Unknown Source)
at org.w3c.domts.DOMTestCase.doMain(Unknown Source)
at org.w3c.domts.level1.core.alltests.main(Unknown Source)
8)
http://www.w3.org/2001/DOM-Test-Suite/level1/core/elementremoveattributenode
nomodificationallowederrEE(org.w3c.domts.JUnitTestCaseAdapter)
java.lang.NullPointerException
at
org.w3c.domts.level1.core.elementremoveattributenodenomodificationallowederr
EE.runTest(Unknown Source)
at org.w3c.domts.JUnitTestCaseAdapter.runTest(Unknown Source)
at org.w3c.domts.JUnitRunner.runTest(Unknown Source)
at org.w3c.domts.JUnitRunner.execute(Unknown Source)
at org.w3c.domts.DOMTestCase.doMain(Unknown Source)
at org.w3c.domts.level1.core.alltests.main(Unknown Source)
9)
http://www.w3.org/2001/DOM-Test-Suite/level1/core/elementremoveattributenomo
dificationallowederrEE(org.w3c.domts.JUnitTestCaseAdapter)
java.lang.NullPointerException
at
org.w3c.domts.level1.core.elementremoveattributenomodificationallowederrEE.r
unTest(Unknown Source)
at org.w3c.domts.JUnitTestCaseAdapter.runTest(Unknown Source)
at org.w3c.domts.JUnitRunner.runTest(Unknown Source)
at org.w3c.domts.JUnitRunner.execute(Unknown Source)
at org.w3c.domts.DOMTestCase.doMain(Unknown Source)
at org.w3c.domts.level1.core.alltests.main(Unknown Source)
10)
http://www.w3.org/2001/DOM-Test-Suite/level1/core/elementreplaceattributewit
hself(org.w3c.domts.JUnitTestCaseAdapter)
org.apache.crimson.tree.DomEx: WRONG_DOCUMENT_ERR: That node doesn't belong
in this document.
at org.apache.crimson.tree.AttributeSet.setNamedItem(AttributeSet.java:432)
at
org.apache.crimson.tree.ElementNode2.setAttributeNode(ElementNode2.java:572)
at org.w3c.domts.level1.core.elementreplaceattributewithself.runTest(Unknown
Source)
at org.w3c.domts.JUnitTestCaseAdapter.runTest(Unknown Source)
at org.w3c.domts.JUnitRunner.runTest(Unknown Source)
at org.w3c.domts.JUnitRunner.execute(Unknown Source)
at org.w3c.domts.DOMTestCase.doMain(Unknown Source)
at org.w3c.domts.level1.core.alltests.main(Unknown Source)
11)
http://www.w3.org/2001/DOM-Test-Suite/level1/core/elementsetattributenodenom
odificationallowederrEE(org.w3c.domts.JUnitTestCaseAdapter)
java.lang.NullPointerException
at
org.w3c.domts.level1.core.elementsetattributenodenomodificationallowederrEE.
runTest(Unknown Source)
at org.w3c.domts.JUnitTestCaseAdapter.runTest(Unknown Source)
at org.w3c.domts.JUnitRunner.runTest(Unknown Source)
at org.w3c.domts.JUnitRunner.execute(Unknown Source)
at org.w3c.domts.DOMTestCase.doMain(Unknown Source)
at org.w3c.domts.level1.core.alltests.main(Unknown Source)
12)
http://www.w3.org/2001/DOM-Test-Suite/level1/core/elementsetattributenomodif
icationallowederrEE(org.w3c.domts.JUnitTestCaseAdapter)
java.lang.NullPointerException
at
org.w3c.domts.level1.core.elementsetattributenomodificationallowederrEE.runT
est(Unknown Source)
at org.w3c.domts.JUnitTestCaseAdapter.runTest(Unknown Source)
at org.w3c.domts.JUnitRunner.runTest(Unknown Source)
at org.w3c.domts.JUnitRunner.execute(Unknown Source)
at org.w3c.domts.DOMTestCase.doMain(Unknown Source)
at org.w3c.domts.level1.core.alltests.main(Unknown Source)
13)
http://www.w3.org/2001/DOM-Test-Suite/level1/core/nodesetnodevaluenomodifica
tionallowederrEE(org.w3c.domts.JUnitTestCaseAdapter)
java.lang.NullPointerException
at
org.w3c.domts.level1.core.nodesetnodevaluenomodificationallowederrEE.runTest
(Unknown Source)
at org.w3c.domts.JUnitTestCaseAdapter.runTest(Unknown Source)
at org.w3c.domts.JUnitRunner.runTest(Unknown Source)
at org.w3c.domts.JUnitRunner.execute(Unknown Source)
at org.w3c.domts.DOMTestCase.doMain(Unknown Source)
at org.w3c.domts.level1.core.alltests.main(Unknown Source)
14)
http://www.w3.org/2001/DOM-Test-Suite/level1/core/processinginstructionsetda
tanomodificationallowederrEE(org.w3c.domts.JUnitTestCaseAdapter)
java.lang.ClassCastException: org.apache.crimson.tree.TextNode
at
org.w3c.domts.level1.core.processinginstructionsetdatanomodificationallowede
rrEE.runTest(Unknown Source)
at org.w3c.domts.JUnitTestCaseAdapter.runTest(Unknown Source)
at org.w3c.domts.JUnitRunner.runTest(Unknown Source)
at org.w3c.domts.JUnitRunner.execute(Unknown Source)
at org.w3c.domts.DOMTestCase.doMain(Unknown Source)
at org.w3c.domts.level1.core.alltests.main(Unknown Source)
15)
http://www.w3.org/2001/DOM-Test-Suite/level1/core/textsplittextnomodificatio
nallowederrEE(org.w3c.domts.JUnitTestCaseAdapter)
java.lang.NullPointerException
at
org.w3c.domts.level1.core.textsplittextnomodificationallowederrEE.runTest(Un
known Source)
at org.w3c.domts.JUnitTestCaseAdapter.runTest(Unknown Source)
at org.w3c.domts.JUnitRunner.runTest(Unknown Source)
at org.w3c.domts.JUnitRunner.execute(Unknown Source)
at org.w3c.domts.DOMTestCase.doMain(Unknown Source)
at org.w3c.domts.level1.core.alltests.main(Unknown Source)
There were 7 failures:
1)
http://www.w3.org/2001/DOM-Test-Suite/level1/core/documentcreateentityrefere
nceknown(org.w3c.domts.JUnitTestCaseAdapter)junit.framework.AssertionFailedE
rror: size expected:<1> but was:<0>
at org.w3c.domts.JUnitTestCaseAdapter.assertSize(Unknown Source)
at org.w3c.domts.DOMTestCase.assertSize(Unknown Source)
at
org.w3c.domts.level1.core.documentcreateentityreferenceknown.runTest(Unknown
Source)
at org.w3c.domts.JUnitTestCaseAdapter.runTest(Unknown Source)
at org.w3c.domts.JUnitRunner.runTest(Unknown Source)
at org.w3c.domts.JUnitRunner.execute(Unknown Source)
at org.w3c.domts.DOMTestCase.doMain(Unknown Source)
at org.w3c.domts.level1.core.alltests.main(Unknown Source)
2)
http://www.w3.org/2001/DOM-Test-Suite/level1/core/entitygetpublicid(org.w3c.
domts.JUnitTestCaseAdapter)junit.framework.AssertionFailedError:
systemIdStrict expected:<entityFile> but
was:<jar:file:/D:/domts/2001/DOM-Test-Suite/dist/dom1-core.jar!/entityFile>
at org.w3c.domts.JUnitTestCaseAdapter.assertEquals(Unknown Source)
at org.w3c.domts.DOMTestCase.assertEquals(Unknown Source)
at org.w3c.domts.level1.core.entitygetpublicid.runTest(Unknown Source)
at org.w3c.domts.JUnitTestCaseAdapter.runTest(Unknown Source)
at org.w3c.domts.JUnitRunner.runTest(Unknown Source)
at org.w3c.domts.JUnitRunner.execute(Unknown Source)
at org.w3c.domts.DOMTestCase.doMain(Unknown Source)
at org.w3c.domts.level1.core.alltests.main(Unknown Source)
3)
http://www.w3.org/2001/DOM-Test-Suite/level1/core/nodeappendchildnomodificat
ionallowederrEE(org.w3c.domts.JUnitTestCaseAdapter)junit.framework.Assertion
FailedError: throw_NO_MODIFICATION_ALLOWED_ERR
at org.w3c.domts.JUnitTestCaseAdapter.assertTrue(Unknown Source)
at org.w3c.domts.DOMTestCase.assertTrue(Unknown Source)
at
org.w3c.domts.level1.core.nodeappendchildnomodificationallowederrEE.runTest(
Unknown Source)
at org.w3c.domts.JUnitTestCaseAdapter.runTest(Unknown Source)
at org.w3c.domts.JUnitRunner.runTest(Unknown Source)
at org.w3c.domts.JUnitRunner.execute(Unknown Source)
at org.w3c.domts.DOMTestCase.doMain(Unknown Source)
at org.w3c.domts.level1.core.alltests.main(Unknown Source)
4)
http://www.w3.org/2001/DOM-Test-Suite/level1/core/nodeinsertbeforenomodifica
tionallowederrEE(org.w3c.domts.JUnitTestCaseAdapter)junit.framework.Assertio
nFailedError: nodeInsertBeforeNoModificationAllowedErrAssert
at org.w3c.domts.JUnitTestCaseAdapter.assertTrue(Unknown Source)
at org.w3c.domts.DOMTestCase.assertTrue(Unknown Source)
at
org.w3c.domts.level1.core.nodeinsertbeforenomodificationallowederrEE.runTest
(Unknown Source)
at org.w3c.domts.JUnitTestCaseAdapter.runTest(Unknown Source)
at org.w3c.domts.JUnitRunner.runTest(Unknown Source)
at org.w3c.domts.JUnitRunner.execute(Unknown Source)
at org.w3c.domts.DOMTestCase.doMain(Unknown Source)
at org.w3c.domts.level1.core.alltests.main(Unknown Source)
5)
http://www.w3.org/2001/DOM-Test-Suite/level1/core/noderemovechildnomodificat
ionallowederrEE(org.w3c.domts.JUnitTestCaseAdapter)junit.framework.Assertion
FailedError: throw_NO_MODIFICATION_ALLOWED_ERR
at org.w3c.domts.JUnitTestCaseAdapter.assertTrue(Unknown Source)
at org.w3c.domts.DOMTestCase.assertTrue(Unknown Source)
at
org.w3c.domts.level1.core.noderemovechildnomodificationallowederrEE.runTest(
Unknown Source)
at org.w3c.domts.JUnitTestCaseAdapter.runTest(Unknown Source)
at org.w3c.domts.JUnitRunner.runTest(Unknown Source)
at org.w3c.domts.JUnitRunner.execute(Unknown Source)
at org.w3c.domts.DOMTestCase.doMain(Unknown Source)
at org.w3c.domts.level1.core.alltests.main(Unknown Source)
6)
http://www.w3.org/2001/DOM-Test-Suite/level1/core/nodereplacechildnomodifica
tionallowederrEE(org.w3c.domts.JUnitTestCaseAdapter)junit.framework.Assertio
nFailedError: throw_NO_MODIFICATION_ALLOWED_ERR
at org.w3c.domts.JUnitTestCaseAdapter.assertTrue(Unknown Source)
at org.w3c.domts.DOMTestCase.assertTrue(Unknown Source)
at
org.w3c.domts.level1.core.nodereplacechildnomodificationallowederrEE.runTest
(Unknown Source)
at org.w3c.domts.JUnitTestCaseAdapter.runTest(Unknown Source)
at org.w3c.domts.JUnitRunner.runTest(Unknown Source)
at org.w3c.domts.JUnitRunner.execute(Unknown Source)
at org.w3c.domts.DOMTestCase.doMain(Unknown Source)
at org.w3c.domts.level1.core.alltests.main(Unknown Source)
7)
http://www.w3.org/2001/DOM-Test-Suite/level1/core/notationgetsystemid(org.w3
c.domts.JUnitTestCaseAdapter)junit.framework.AssertionFailedError:
exactEquals expected:<notation2File> but
was:<jar:file:/D:/domts/2001/DOM-Test-Suite/dist/dom1-core.jar!/notation2Fil
e>
at org.w3c.domts.JUnitTestCaseAdapter.assertEquals(Unknown Source)
at org.w3c.domts.DOMTestCase.assertEquals(Unknown Source)
at org.w3c.domts.level1.core.notationgetsystemid.runTest(Unknown Source)
at org.w3c.domts.JUnitTestCaseAdapter.runTest(Unknown Source)
at org.w3c.domts.JUnitRunner.runTest(Unknown Source)
at org.w3c.domts.JUnitRunner.execute(Unknown Source)
at org.w3c.domts.DOMTestCase.doMain(Unknown Source)
at org.w3c.domts.level1.core.alltests.main(Unknown Source)

FAILURES!!!
Tests run: 290, Failures: 7, Errors: 15
Received on Wednesday, 14 November 2001 05:06:53 GMT

This archive was generated by hypermail 2.2.0+W3C-0.50 : Monday, 6 April 2009 12:58:45 GMT