W3C home > Mailing lists > Public > www-dom-ts@w3.org > November 2001

Xerces-J 2 nightly build

From: Curt Arnold <carnold@houston.rr.com>
Date: Wed, 14 Nov 2001 03:44:00 -0600
Message-ID: <001401c16cf0$e3ce1810$7600a8c0@CurtMicron>
To: <www-dom-ts@w3.org>
Test elementreplacenodewithself:

Fails here too

Tests *EE and documentcreateentityreferenceknown:

Fail to add entity content to entity references in both entity
preserving and entity expanding modes.

Tests cdatasectiongetdata and cdatasectionnormalize

Seem to be dropping a few characters

Test documentcreateelementdefaultattr

Appears to be adding all defined attributes, not just those with default
values
to created elements in both modes.




isCoalescing() == false
isExpandEntityReferences() == false
isIgnoringComments() == false
isIgnoringElementContentWhitespace() == false
isNamespaceAware() == false
isValidating() == false
.............E....F.F....E.......E............
......E.......E..E...........F..F.............
..............................E..E..E.......
E...E......................................
.........................................
.........................................
............E...................E..........
...
Time: 4.686
There were 13 errors:
1)
http://www.w3.org/2001/DOM-Test-Suite/level1/core/attrsetvaluenomodification
allowederrEE(org.w3c.domts.JUnitTestCaseAdapter)
java.lang.NullPointerException
at
org.w3c.domts.level1.core.attrsetvaluenomodificationallowederrEE.runTest(Unk
nown Source)
at org.w3c.domts.JUnitTestCaseAdapter.runTest(Unknown Source)
at org.w3c.domts.JUnitRunner.runTest(Unknown Source)
at org.w3c.domts.JUnitRunner.execute(Unknown Source)
at org.w3c.domts.DOMTestCase.doMain(Unknown Source)
at org.w3c.domts.level1.core.alltests.main(Unknown Source)
2)
http://www.w3.org/2001/DOM-Test-Suite/level1/core/characterdataappenddatanom
odificationallowederrEE(org.w3c.domts.JUnitTestCaseAdapter)
java.lang.NullPointerException
at
org.w3c.domts.level1.core.characterdataappenddatanomodificationallowederrEE.
runTest(Unknown Source)
at org.w3c.domts.JUnitTestCaseAdapter.runTest(Unknown Source)
at org.w3c.domts.JUnitRunner.runTest(Unknown Source)
at org.w3c.domts.JUnitRunner.execute(Unknown Source)
at org.w3c.domts.DOMTestCase.doMain(Unknown Source)
at org.w3c.domts.level1.core.alltests.main(Unknown Source)
3)
http://www.w3.org/2001/DOM-Test-Suite/level1/core/characterdatadeletedatanom
odificationallowederrEE(org.w3c.domts.JUnitTestCaseAdapter)
java.lang.NullPointerException
at
org.w3c.domts.level1.core.characterdatadeletedatanomodificationallowederrEE.
runTest(Unknown Source)
at org.w3c.domts.JUnitTestCaseAdapter.runTest(Unknown Source)
at org.w3c.domts.JUnitRunner.runTest(Unknown Source)
at org.w3c.domts.JUnitRunner.execute(Unknown Source)
at org.w3c.domts.DOMTestCase.doMain(Unknown Source)
at org.w3c.domts.level1.core.alltests.main(Unknown Source)
4)
http://www.w3.org/2001/DOM-Test-Suite/level1/core/characterdatainsertdatanom
odificationallowederrEE(org.w3c.domts.JUnitTestCaseAdapter)
java.lang.NullPointerException
at
org.w3c.domts.level1.core.characterdatainsertdatanomodificationallowederrEE.
runTest(Unknown Source)
at org.w3c.domts.JUnitTestCaseAdapter.runTest(Unknown Source)
at org.w3c.domts.JUnitRunner.runTest(Unknown Source)
at org.w3c.domts.JUnitRunner.execute(Unknown Source)
at org.w3c.domts.DOMTestCase.doMain(Unknown Source)
at org.w3c.domts.level1.core.alltests.main(Unknown Source)
5)
http://www.w3.org/2001/DOM-Test-Suite/level1/core/characterdatareplacedatano
modificationallowederrEE(org.w3c.domts.JUnitTestCaseAdapter)
java.lang.NullPointerException
at
org.w3c.domts.level1.core.characterdatareplacedatanomodificationallowederrEE
.runTest(Unknown Source)
at org.w3c.domts.JUnitTestCaseAdapter.runTest(Unknown Source)
at org.w3c.domts.JUnitRunner.runTest(Unknown Source)
at org.w3c.domts.JUnitRunner.execute(Unknown Source)
at org.w3c.domts.DOMTestCase.doMain(Unknown Source)
at org.w3c.domts.level1.core.alltests.main(Unknown Source)
6)
http://www.w3.org/2001/DOM-Test-Suite/level1/core/characterdatasetdatanomodi
ficationallowederrEE(org.w3c.domts.JUnitTestCaseAdapter)
java.lang.NullPointerException
at
org.w3c.domts.level1.core.characterdatasetdatanomodificationallowederrEE.run
Test(Unknown Source)
at org.w3c.domts.JUnitTestCaseAdapter.runTest(Unknown Source)
at org.w3c.domts.JUnitRunner.runTest(Unknown Source)
at org.w3c.domts.JUnitRunner.execute(Unknown Source)
at org.w3c.domts.DOMTestCase.doMain(Unknown Source)
at org.w3c.domts.level1.core.alltests.main(Unknown Source)
7)
http://www.w3.org/2001/DOM-Test-Suite/level1/core/elementremoveattributenode
nomodificationallowederrEE(org.w3c.domts.JUnitTestCaseAdapter)
java.lang.NullPointerException
at
org.w3c.domts.level1.core.elementremoveattributenodenomodificationallowederr
EE.runTest(Unknown Source)
at org.w3c.domts.JUnitTestCaseAdapter.runTest(Unknown Source)
at org.w3c.domts.JUnitRunner.runTest(Unknown Source)
at org.w3c.domts.JUnitRunner.execute(Unknown Source)
at org.w3c.domts.DOMTestCase.doMain(Unknown Source)
at org.w3c.domts.level1.core.alltests.main(Unknown Source)
8)
http://www.w3.org/2001/DOM-Test-Suite/level1/core/elementremoveattributenomo
dificationallowederrEE(org.w3c.domts.JUnitTestCaseAdapter)
java.lang.NullPointerException
at
org.w3c.domts.level1.core.elementremoveattributenomodificationallowederrEE.r
unTest(Unknown Source)
at org.w3c.domts.JUnitTestCaseAdapter.runTest(Unknown Source)
at org.w3c.domts.JUnitRunner.runTest(Unknown Source)
at org.w3c.domts.JUnitRunner.execute(Unknown Source)
at org.w3c.domts.DOMTestCase.doMain(Unknown Source)
at org.w3c.domts.level1.core.alltests.main(Unknown Source)
9)
http://www.w3.org/2001/DOM-Test-Suite/level1/core/elementreplaceattributewit
hself(org.w3c.domts.JUnitTestCaseAdapter)
org.w3c.dom.DOMException: DOM009 Attribute already in use
at org.apache.xerces.dom.AttributeMap.setNamedItem(Unknown Source)
at org.apache.xerces.dom.ElementImpl.setAttributeNode(Unknown Source)
at org.w3c.domts.level1.core.elementreplaceattributewithself.runTest(Unknown
Source)
at org.w3c.domts.JUnitTestCaseAdapter.runTest(Unknown Source)
at org.w3c.domts.JUnitRunner.runTest(Unknown Source)
at org.w3c.domts.JUnitRunner.execute(Unknown Source)
at org.w3c.domts.DOMTestCase.doMain(Unknown Source)
at org.w3c.domts.level1.core.alltests.main(Unknown Source)
10)
http://www.w3.org/2001/DOM-Test-Suite/level1/core/elementsetattributenodenom
odificationallowederrEE(org.w3c.domts.JUnitTestCaseAdapter)
java.lang.NullPointerException
at
org.w3c.domts.level1.core.elementsetattributenodenomodificationallowederrEE.
runTest(Unknown Source)
at org.w3c.domts.JUnitTestCaseAdapter.runTest(Unknown Source)
at org.w3c.domts.JUnitRunner.runTest(Unknown Source)
at org.w3c.domts.JUnitRunner.execute(Unknown Source)
at org.w3c.domts.DOMTestCase.doMain(Unknown Source)
at org.w3c.domts.level1.core.alltests.main(Unknown Source)
11)
http://www.w3.org/2001/DOM-Test-Suite/level1/core/elementsetattributenomodif
icationallowederrEE(org.w3c.domts.JUnitTestCaseAdapter)
java.lang.NullPointerException
at
org.w3c.domts.level1.core.elementsetattributenomodificationallowederrEE.runT
est(Unknown Source)
at org.w3c.domts.JUnitTestCaseAdapter.runTest(Unknown Source)
at org.w3c.domts.JUnitRunner.runTest(Unknown Source)
at org.w3c.domts.JUnitRunner.execute(Unknown Source)
at org.w3c.domts.DOMTestCase.doMain(Unknown Source)
at org.w3c.domts.level1.core.alltests.main(Unknown Source)
12)
http://www.w3.org/2001/DOM-Test-Suite/level1/core/nodesetnodevaluenomodifica
tionallowederrEE(org.w3c.domts.JUnitTestCaseAdapter)
java.lang.NullPointerException
at
org.w3c.domts.level1.core.nodesetnodevaluenomodificationallowederrEE.runTest
(Unknown Source)
at org.w3c.domts.JUnitTestCaseAdapter.runTest(Unknown Source)
at org.w3c.domts.JUnitRunner.runTest(Unknown Source)
at org.w3c.domts.JUnitRunner.execute(Unknown Source)
at org.w3c.domts.DOMTestCase.doMain(Unknown Source)
at org.w3c.domts.level1.core.alltests.main(Unknown Source)
13)
http://www.w3.org/2001/DOM-Test-Suite/level1/core/textsplittextnomodificatio
nallowederrEE(org.w3c.domts.JUnitTestCaseAdapter)
java.lang.NullPointerException
at
org.w3c.domts.level1.core.textsplittextnomodificationallowederrEE.runTest(Un
known Source)
at org.w3c.domts.JUnitTestCaseAdapter.runTest(Unknown Source)
at org.w3c.domts.JUnitRunner.runTest(Unknown Source)
at org.w3c.domts.JUnitRunner.execute(Unknown Source)
at org.w3c.domts.DOMTestCase.doMain(Unknown Source)
at org.w3c.domts.level1.core.alltests.main(Unknown Source)
There were 4 failures:
1)
http://www.w3.org/2001/DOM-Test-Suite/level1/core/cdatasectiongetdata(org.w3
c.domts.JUnitTestCaseAdapter)junit.framework.AssertionFailedError: data
expected:<This is an adjacent CDATASection with a reference to a tab &tab;>
but was:<This is an adjacent CDATASection with a reference to a ta>
at org.w3c.domts.JUnitTestCaseAdapter.assertEquals(Unknown Source)
at org.w3c.domts.DOMTestCase.assertEquals(Unknown Source)
at org.w3c.domts.level1.core.cdatasectiongetdata.runTest(Unknown Source)
at org.w3c.domts.JUnitTestCaseAdapter.runTest(Unknown Source)
at org.w3c.domts.JUnitRunner.runTest(Unknown Source)
at org.w3c.domts.JUnitRunner.execute(Unknown Source)
at org.w3c.domts.DOMTestCase.doMain(Unknown Source)
at org.w3c.domts.level1.core.alltests.main(Unknown Source)
2)
http://www.w3.org/2001/DOM-Test-Suite/level1/core/cdatasectionnormalize(org.
w3c.domts.JUnitTestCaseAdapter)junit.framework.AssertionFailedError: data3
expected:<This is an adjacent CDATASection with a reference to a tab &tab;>
but was:<This is an adjacent CDATASection with a reference to a ta>
at org.w3c.domts.JUnitTestCaseAdapter.assertEquals(Unknown Source)
at org.w3c.domts.DOMTestCase.assertEquals(Unknown Source)
at org.w3c.domts.level1.core.cdatasectionnormalize.runTest(Unknown Source)
at org.w3c.domts.JUnitTestCaseAdapter.runTest(Unknown Source)
at org.w3c.domts.JUnitRunner.runTest(Unknown Source)
at org.w3c.domts.JUnitRunner.execute(Unknown Source)
at org.w3c.domts.DOMTestCase.doMain(Unknown Source)
at org.w3c.domts.level1.core.alltests.main(Unknown Source)
3)
http://www.w3.org/2001/DOM-Test-Suite/level1/core/documentcreateelementdefau
ltattr(org.w3c.domts.JUnitTestCaseAdapter)junit.framework.AssertionFailedErr
or: attrName expected:<street> but was:<domestic>
at org.w3c.domts.JUnitTestCaseAdapter.assertEquals(Unknown Source)
at org.w3c.domts.DOMTestCase.assertEquals(Unknown Source)
at
org.w3c.domts.level1.core.documentcreateelementdefaultattr.runTest(Unknown
Source)
at org.w3c.domts.JUnitTestCaseAdapter.runTest(Unknown Source)
at org.w3c.domts.JUnitRunner.runTest(Unknown Source)
at org.w3c.domts.JUnitRunner.execute(Unknown Source)
at org.w3c.domts.DOMTestCase.doMain(Unknown Source)
at org.w3c.domts.level1.core.alltests.main(Unknown Source)
4)
http://www.w3.org/2001/DOM-Test-Suite/level1/core/documentcreateentityrefere
nceknown(org.w3c.domts.JUnitTestCaseAdapter)junit.framework.AssertionFailedE
rror: size expected:<1> but was:<0>
at org.w3c.domts.JUnitTestCaseAdapter.assertSize(Unknown Source)
at org.w3c.domts.DOMTestCase.assertSize(Unknown Source)
at
org.w3c.domts.level1.core.documentcreateentityreferenceknown.runTest(Unknown
Source)
at org.w3c.domts.JUnitTestCaseAdapter.runTest(Unknown Source)
at org.w3c.domts.JUnitRunner.runTest(Unknown Source)
at org.w3c.domts.JUnitRunner.execute(Unknown Source)
at org.w3c.domts.DOMTestCase.doMain(Unknown Source)
at org.w3c.domts.level1.core.alltests.main(Unknown Source)

FAILURES!!!
Tests run: 290, Failures: 4, Errors: 13

isCoalescing() == false
isExpandEntityReferences() == true
isIgnoringComments() == false
isIgnoringElementContentWhitespace() == true
isNamespaceAware() == true
isValidating() == true
.............E....F.F....E.......E............
......E.......E..E...........F..F.............
..............................E..E..E.......
E...E......................................
.........................................
.........................................
............E.............E......E..........
...
Time: 2.814
There were 14 errors:
1)
http://www.w3.org/2001/DOM-Test-Suite/level1/core/attrsetvaluenomodification
allowederrEE(org.w3c.domts.JUnitTestCaseAdapter)
java.lang.NullPointerException
at
org.w3c.domts.level1.core.attrsetvaluenomodificationallowederrEE.runTest(Unk
nown Source)
at org.w3c.domts.JUnitTestCaseAdapter.runTest(Unknown Source)
at org.w3c.domts.JUnitRunner.runTest(Unknown Source)
at org.w3c.domts.JUnitRunner.execute(Unknown Source)
at org.w3c.domts.DOMTestCase.doMain(Unknown Source)
at org.w3c.domts.level1.core.alltests.main(Unknown Source)
2)
http://www.w3.org/2001/DOM-Test-Suite/level1/core/characterdataappenddatanom
odificationallowederrEE(org.w3c.domts.JUnitTestCaseAdapter)
java.lang.NullPointerException
at
org.w3c.domts.level1.core.characterdataappenddatanomodificationallowederrEE.
runTest(Unknown Source)
at org.w3c.domts.JUnitTestCaseAdapter.runTest(Unknown Source)
at org.w3c.domts.JUnitRunner.runTest(Unknown Source)
at org.w3c.domts.JUnitRunner.execute(Unknown Source)
at org.w3c.domts.DOMTestCase.doMain(Unknown Source)
at org.w3c.domts.level1.core.alltests.main(Unknown Source)
3)
http://www.w3.org/2001/DOM-Test-Suite/level1/core/characterdatadeletedatanom
odificationallowederrEE(org.w3c.domts.JUnitTestCaseAdapter)
java.lang.NullPointerException
at
org.w3c.domts.level1.core.characterdatadeletedatanomodificationallowederrEE.
runTest(Unknown Source)
at org.w3c.domts.JUnitTestCaseAdapter.runTest(Unknown Source)
at org.w3c.domts.JUnitRunner.runTest(Unknown Source)
at org.w3c.domts.JUnitRunner.execute(Unknown Source)
at org.w3c.domts.DOMTestCase.doMain(Unknown Source)
at org.w3c.domts.level1.core.alltests.main(Unknown Source)
4)
http://www.w3.org/2001/DOM-Test-Suite/level1/core/characterdatainsertdatanom
odificationallowederrEE(org.w3c.domts.JUnitTestCaseAdapter)
java.lang.NullPointerException
at
org.w3c.domts.level1.core.characterdatainsertdatanomodificationallowederrEE.
runTest(Unknown Source)
at org.w3c.domts.JUnitTestCaseAdapter.runTest(Unknown Source)
at org.w3c.domts.JUnitRunner.runTest(Unknown Source)
at org.w3c.domts.JUnitRunner.execute(Unknown Source)
at org.w3c.domts.DOMTestCase.doMain(Unknown Source)
at org.w3c.domts.level1.core.alltests.main(Unknown Source)
5)
http://www.w3.org/2001/DOM-Test-Suite/level1/core/characterdatareplacedatano
modificationallowederrEE(org.w3c.domts.JUnitTestCaseAdapter)
java.lang.NullPointerException
at
org.w3c.domts.level1.core.characterdatareplacedatanomodificationallowederrEE
.runTest(Unknown Source)
at org.w3c.domts.JUnitTestCaseAdapter.runTest(Unknown Source)
at org.w3c.domts.JUnitRunner.runTest(Unknown Source)
at org.w3c.domts.JUnitRunner.execute(Unknown Source)
at org.w3c.domts.DOMTestCase.doMain(Unknown Source)
at org.w3c.domts.level1.core.alltests.main(Unknown Source)
6)
http://www.w3.org/2001/DOM-Test-Suite/level1/core/characterdatasetdatanomodi
ficationallowederrEE(org.w3c.domts.JUnitTestCaseAdapter)
java.lang.NullPointerException
at
org.w3c.domts.level1.core.characterdatasetdatanomodificationallowederrEE.run
Test(Unknown Source)
at org.w3c.domts.JUnitTestCaseAdapter.runTest(Unknown Source)
at org.w3c.domts.JUnitRunner.runTest(Unknown Source)
at org.w3c.domts.JUnitRunner.execute(Unknown Source)
at org.w3c.domts.DOMTestCase.doMain(Unknown Source)
at org.w3c.domts.level1.core.alltests.main(Unknown Source)
7)
http://www.w3.org/2001/DOM-Test-Suite/level1/core/elementremoveattributenode
nomodificationallowederrEE(org.w3c.domts.JUnitTestCaseAdapter)
java.lang.NullPointerException
at
org.w3c.domts.level1.core.elementremoveattributenodenomodificationallowederr
EE.runTest(Unknown Source)
at org.w3c.domts.JUnitTestCaseAdapter.runTest(Unknown Source)
at org.w3c.domts.JUnitRunner.runTest(Unknown Source)
at org.w3c.domts.JUnitRunner.execute(Unknown Source)
at org.w3c.domts.DOMTestCase.doMain(Unknown Source)
at org.w3c.domts.level1.core.alltests.main(Unknown Source)
8)
http://www.w3.org/2001/DOM-Test-Suite/level1/core/elementremoveattributenomo
dificationallowederrEE(org.w3c.domts.JUnitTestCaseAdapter)
java.lang.NullPointerException
at
org.w3c.domts.level1.core.elementremoveattributenomodificationallowederrEE.r
unTest(Unknown Source)
at org.w3c.domts.JUnitTestCaseAdapter.runTest(Unknown Source)
at org.w3c.domts.JUnitRunner.runTest(Unknown Source)
at org.w3c.domts.JUnitRunner.execute(Unknown Source)
at org.w3c.domts.DOMTestCase.doMain(Unknown Source)
at org.w3c.domts.level1.core.alltests.main(Unknown Source)
9)
http://www.w3.org/2001/DOM-Test-Suite/level1/core/elementreplaceattributewit
hself(org.w3c.domts.JUnitTestCaseAdapter)
org.w3c.dom.DOMException: DOM009 Attribute already in use
at org.apache.xerces.dom.AttributeMap.setNamedItem(Unknown Source)
at org.apache.xerces.dom.ElementImpl.setAttributeNode(Unknown Source)
at org.w3c.domts.level1.core.elementreplaceattributewithself.runTest(Unknown
Source)
at org.w3c.domts.JUnitTestCaseAdapter.runTest(Unknown Source)
at org.w3c.domts.JUnitRunner.runTest(Unknown Source)
at org.w3c.domts.JUnitRunner.execute(Unknown Source)
at org.w3c.domts.DOMTestCase.doMain(Unknown Source)
at org.w3c.domts.level1.core.alltests.main(Unknown Source)
10)
http://www.w3.org/2001/DOM-Test-Suite/level1/core/elementsetattributenodenom
odificationallowederrEE(org.w3c.domts.JUnitTestCaseAdapter)
java.lang.NullPointerException
at
org.w3c.domts.level1.core.elementsetattributenodenomodificationallowederrEE.
runTest(Unknown Source)
at org.w3c.domts.JUnitTestCaseAdapter.runTest(Unknown Source)
at org.w3c.domts.JUnitRunner.runTest(Unknown Source)
at org.w3c.domts.JUnitRunner.execute(Unknown Source)
at org.w3c.domts.DOMTestCase.doMain(Unknown Source)
at org.w3c.domts.level1.core.alltests.main(Unknown Source)
11)
http://www.w3.org/2001/DOM-Test-Suite/level1/core/elementsetattributenomodif
icationallowederrEE(org.w3c.domts.JUnitTestCaseAdapter)
java.lang.NullPointerException
at
org.w3c.domts.level1.core.elementsetattributenomodificationallowederrEE.runT
est(Unknown Source)
at org.w3c.domts.JUnitTestCaseAdapter.runTest(Unknown Source)
at org.w3c.domts.JUnitRunner.runTest(Unknown Source)
at org.w3c.domts.JUnitRunner.execute(Unknown Source)
at org.w3c.domts.DOMTestCase.doMain(Unknown Source)
at org.w3c.domts.level1.core.alltests.main(Unknown Source)
12)
http://www.w3.org/2001/DOM-Test-Suite/level1/core/nodesetnodevaluenomodifica
tionallowederrEE(org.w3c.domts.JUnitTestCaseAdapter)
java.lang.NullPointerException
at
org.w3c.domts.level1.core.nodesetnodevaluenomodificationallowederrEE.runTest
(Unknown Source)
at org.w3c.domts.JUnitTestCaseAdapter.runTest(Unknown Source)
at org.w3c.domts.JUnitRunner.runTest(Unknown Source)
at org.w3c.domts.JUnitRunner.execute(Unknown Source)
at org.w3c.domts.DOMTestCase.doMain(Unknown Source)
at org.w3c.domts.level1.core.alltests.main(Unknown Source)
13)
http://www.w3.org/2001/DOM-Test-Suite/level1/core/processinginstructionsetda
tanomodificationallowederrEE(org.w3c.domts.JUnitTestCaseAdapter)
java.lang.ClassCastException: org.apache.xerces.dom.DeferredTextImpl
at
org.w3c.domts.level1.core.processinginstructionsetdatanomodificationallowede
rrEE.runTest(Unknown Source)
at org.w3c.domts.JUnitTestCaseAdapter.runTest(Unknown Source)
at org.w3c.domts.JUnitRunner.runTest(Unknown Source)
at org.w3c.domts.JUnitRunner.execute(Unknown Source)
at org.w3c.domts.DOMTestCase.doMain(Unknown Source)
at org.w3c.domts.level1.core.alltests.main(Unknown Source)
14)
http://www.w3.org/2001/DOM-Test-Suite/level1/core/textsplittextnomodificatio
nallowederrEE(org.w3c.domts.JUnitTestCaseAdapter)
java.lang.NullPointerException
at
org.w3c.domts.level1.core.textsplittextnomodificationallowederrEE.runTest(Un
known Source)
at org.w3c.domts.JUnitTestCaseAdapter.runTest(Unknown Source)
at org.w3c.domts.JUnitRunner.runTest(Unknown Source)
at org.w3c.domts.JUnitRunner.execute(Unknown Source)
at org.w3c.domts.DOMTestCase.doMain(Unknown Source)
at org.w3c.domts.level1.core.alltests.main(Unknown Source)
There were 4 failures:
1)
http://www.w3.org/2001/DOM-Test-Suite/level1/core/cdatasectiongetdata(org.w3
c.domts.JUnitTestCaseAdapter)junit.framework.AssertionFailedError: data
expected:<This is an adjacent CDATASection with a reference to a tab &tab;>
but was:<This is an adjacent CDATASection with a reference to a ta>
at org.w3c.domts.JUnitTestCaseAdapter.assertEquals(Unknown Source)
at org.w3c.domts.DOMTestCase.assertEquals(Unknown Source)
at org.w3c.domts.level1.core.cdatasectiongetdata.runTest(Unknown Source)
at org.w3c.domts.JUnitTestCaseAdapter.runTest(Unknown Source)
at org.w3c.domts.JUnitRunner.runTest(Unknown Source)
at org.w3c.domts.JUnitRunner.execute(Unknown Source)
at org.w3c.domts.DOMTestCase.doMain(Unknown Source)
at org.w3c.domts.level1.core.alltests.main(Unknown Source)
2)
http://www.w3.org/2001/DOM-Test-Suite/level1/core/cdatasectionnormalize(org.
w3c.domts.JUnitTestCaseAdapter)junit.framework.AssertionFailedError: data3
expected:<This is an adjacent CDATASection with a reference to a tab &tab;>
but was:<This is an adjacent CDATASection with a reference to a ta>
at org.w3c.domts.JUnitTestCaseAdapter.assertEquals(Unknown Source)
at org.w3c.domts.DOMTestCase.assertEquals(Unknown Source)
at org.w3c.domts.level1.core.cdatasectionnormalize.runTest(Unknown Source)
at org.w3c.domts.JUnitTestCaseAdapter.runTest(Unknown Source)
at org.w3c.domts.JUnitRunner.runTest(Unknown Source)
at org.w3c.domts.JUnitRunner.execute(Unknown Source)
at org.w3c.domts.DOMTestCase.doMain(Unknown Source)
at org.w3c.domts.level1.core.alltests.main(Unknown Source)
3)
http://www.w3.org/2001/DOM-Test-Suite/level1/core/documentcreateelementdefau
ltattr(org.w3c.domts.JUnitTestCaseAdapter)junit.framework.AssertionFailedErr
or: attrName expected:<street> but was:<domestic>
at org.w3c.domts.JUnitTestCaseAdapter.assertEquals(Unknown Source)
at org.w3c.domts.DOMTestCase.assertEquals(Unknown Source)
at
org.w3c.domts.level1.core.documentcreateelementdefaultattr.runTest(Unknown
Source)
at org.w3c.domts.JUnitTestCaseAdapter.runTest(Unknown Source)
at org.w3c.domts.JUnitRunner.runTest(Unknown Source)
at org.w3c.domts.JUnitRunner.execute(Unknown Source)
at org.w3c.domts.DOMTestCase.doMain(Unknown Source)
at org.w3c.domts.level1.core.alltests.main(Unknown Source)
4)
http://www.w3.org/2001/DOM-Test-Suite/level1/core/documentcreateentityrefere
nceknown(org.w3c.domts.JUnitTestCaseAdapter)junit.framework.AssertionFailedE
rror: size expected:<1> but was:<0>
at org.w3c.domts.JUnitTestCaseAdapter.assertSize(Unknown Source)
at org.w3c.domts.DOMTestCase.assertSize(Unknown Source)
at
org.w3c.domts.level1.core.documentcreateentityreferenceknown.runTest(Unknown
Source)
at org.w3c.domts.JUnitTestCaseAdapter.runTest(Unknown Source)
at org.w3c.domts.JUnitRunner.runTest(Unknown Source)
at org.w3c.domts.JUnitRunner.execute(Unknown Source)
at org.w3c.domts.DOMTestCase.doMain(Unknown Source)
at org.w3c.domts.level1.core.alltests.main(Unknown Source)

FAILURES!!!
Tests run: 290, Failures: 4, Errors: 14
Received on Wednesday, 14 November 2001 04:44:47 GMT

This archive was generated by hypermail 2.2.0+W3C-0.50 : Monday, 6 April 2009 12:58:45 GMT