W3C home > Mailing lists > Public > www-dom-ts@w3.org > February 2002

Re: Error in jsunit-init task

From: Dimitris Dimitriadis <dimitris@ontologicon.com>
Date: Thu, 14 Feb 2002 10:32:20 +0100
Cc: <www-dom-ts@w3.org>
To: "Curt Arnold" <carnold@houston.rr.com>
Message-Id: <BE187257-212D-11D6-9D3C-000393556882@ontologicon.com>
I got the error on 3 consecutive fresh checkouts into new dorectories, 
to eliminate the possibility of JsUnit being the cuplrit. I'm trying 
again, if I'm not able to build, could you to a build? I'll take care of 
distributing it if you have limited space.

I'll know in a few hours.

/Dimitris

On Thursday, February 14, 2002, at 03:38 , Curt Arnold wrote:

> Can't repeat it here.  Thought for a moment that Edward Hieatt may have
> updated JSUnit which would have invalidated the patches, but that 
> doesn't
> seem to be the case.  Try deleting jsunit.zip and the jsunit directory 
> from
> lib and run jsunit-init again.  Possibly the files were read-only or 
> already
> patched somehow.
>
>
> ----- Original Message -----
> From: "Dimitris Dimitriadis" <dimitris@ontologicon.com>
> To: <www-dom-ts@w3.org>
> Sent: Wednesday, February 13, 2002 6:06 PM
> Subject: Error in jsunit-init task
>
>
>> When trying to build the TS for release, I did some minor updates
>> (index.htm, test-to-matrix.xml and COPYRIGHT.html), after which I did a
>> fresh checkout and tried to build.
>>
>> I then ran into the following (haven't seen it before):
>>
>> jsunit-init:
>>      [unzip] Expanding: /Users/dimitris/2001/DOM-Test-
>> Suite/lib/jsunit.zip into /Users/dimitris/2001/DOM-Test-Suite/lib
>>      [patch] patching file /Users/dimitris/2001/DOM-Test-
>> Suite/lib/jsunit/app/main.html
>>      [patch] Hunk #1 FAILED at 46.
>>      [patch] Hunk #2 FAILED at 274.
>>      [patch] Hunk #3 FAILED at 280.
>>      [patch] 3 out of 3 hunks FAILED -- saving rejects to file
>> /Users/dimitris/2001/DOM-Test-Suite/lib/jsunit/app/main.html.rej
>>      [patch] patching file /Users/dimitris/2001/DOM-Test-
>> Suite/lib/jsunit/app/jsUnitRunner.js
>>      [patch] Reversed (or previously applied) patch detected!  Assume 
>> -R?
>> [n]
>>      [patch] Apply anyway? [n]
>>      [patch] Skipping patch.
>>      [patch] 3 out of 3 hunks ignored -- saving rejects to file
>> /Users/dimitris/2001/DOM-Test-Suite/lib/jsunit/app/jsUnitRunner.js.rej
>>      [patch] patching file /Users/dimitris/2001/DOM-Test-
>> Suite/lib/jsunit/app/jsUnitCore.js
>>
>> I don't know what to make of this.
>>
>> Anyone?
>>
>> /Dimitris
>>
>>
>
>
Received on Thursday, 14 February 2002 04:31:24 GMT

This archive was generated by hypermail 2.2.0+W3C-0.50 : Monday, 6 April 2009 12:58:45 GMT