Ontology
version info: version 1.0
comment: Ontology for Geograph Information Metadata - ISO 19115 title- ISO 19115 - Geograph Information Metadata creator- Akm Saiful Islam publisher- Drexel University date- 2003-10-19 description- Ontology for ISO 19115 . Vocabulary terms are declared using OWL language to support RDF applications format - text/xml language - English

DQ ThematicClassificationCorrectness
type: Class
stereotypes: class
subclass of: DQ ThematicAccuracy
comment: comparison of the classes assigned to features or their attributes to a universe of discourse
short name: DQThemClassCor

DQ ThematicAccuracy
type: Class
stereotypes: abstractClass
subclass of: DQ Element
comment: accuracy of quantitative attributes and the correctness of non-quantitative attributes and of the classifications of features and their relationships
short name: DQThemAcc

MD DataIdentification
type: Class
stereotypes: class
subclass of: MD Identification
subclass of: Restriction
  on property: supplementalInformation
  min cardinality: 0
subclass of: Restriction
  min cardinality: 0
  on property: extent dataExt
subclass of: Restriction
  on property: environmentDescription
  min cardinality: 0
subclass of: Restriction
  on property: geographicDescription
  min cardinality: 0
subclass of: Restriction
  on property: topicCategory
  min cardinality: 1
subclass of: Restriction
  min cardinality: 0
  on property: characterSet dataChar
subclass of: Restriction
  on property: geographicBox
  min cardinality: 0
subclass of: Restriction
  on property: spatialRepresentationType
  min cardinality: 0
subclass of: Restriction
  min cardinality: 1
  on property: language dataLang
subclass of: Restriction
  on property: spatialResolution
  min cardinality: 0
subclass of: Restriction
  on property: supplementalInformation
  min cardinality: 1
subclass of: Restriction
  on property: environmentDescription
  max cardinality: 1
subclass of: Restriction
  max cardinality: 1
  on property: characterSet dataChar
comment: information required to identify a dataset
short name: DataIdent

MD Identification
type: Class
stereotypes: abstractClass
subclass of: Restriction
  on property: purpose
  min cardinality: 0
subclass of: Restriction
  on property: credit
  min cardinality: 0
subclass of: Restriction
  on property: status
  min cardinality: 0
subclass of: Restriction
  on property: pointOfConact
  min cardinality: 0
subclass of: Restriction
  on property: resourceSpecificUsage
  min cardinality: 0
subclass of: Restriction
  on property: graphicOverview
  min cardinality: 0
subclass of: Restriction
  on property: resourceFormat
  min cardinality: 0
subclass of: Restriction
  on property: resourceMaintenance
  min cardinality: 0
subclass of: Restriction
  on property: descriptiveKeywords
  min cardinality: 0
subclass of: Restriction
  on property: resourceConstraints
  min cardinality: 0
subclass of: Restriction
  on property: citation
  cardinality: 1
subclass of: Restriction
  cardinality: 1
  on property: abstract idAbs
subclass of: Restriction
  on property: purpose
  max cardinality: 1
comment: basic information required to uniquely identify a resource or resources
short name: Ident

supplementalInformation
type: DatatypeProperty
type: FunctionalProperty
short name: suppInfo
range: string
domain: MD DataIdentification
comment: any other descriptive information about the dataset

extent dataExt
type: ObjectProperty
domain: MD DataIdentification
range: EX Extent
comment: additional extent information including the bounding polygon, vertical, and temporal extent of the dataset
short name: dataExt

environmentDescription
type: DatatypeProperty
range: string
domain: MD DataIdentification
comment: description of the dataset in the producer’s processing environment, including items such as the software, the computer operating system, file name, and the dataset size
short name: envirDesc

geographicDescription
type: ObjectProperty
domain: MD DataIdentification
range: EX GeographicDescription
condition: if hierarchyLevel equals "dataset" and geographicBox not documented?
short name: geoDesc
comment: description of the geographic area within which data is available

topicCategory
type: ObjectProperty
domain: MD DataIdentification
range: MD TopicCategoryCode
comment: main theme(s) of the datset
short name: tpCat

characterSet dataChar
type: FunctionalProperty
type: ObjectProperty
default value: utf8
domain: MD DataIdentification
range: MD CharacterSetCode
comment: full name of the character coding standard used for the dataset
short name: dataChar
condition: ISO 10646-1 not used ?

geographicBox
type: ObjectProperty
domain: MD DataIdentification
range: EX GeographicBoundingBox
condition: hierarchyLevel equals "dataset" and geographicDescription not docum,ented ?
comment: minimum bounding rectangle within which data is available
short name: geoBox

spatialRepresentationType
type: ObjectProperty
domain: MD DataIdentification
range: MD SpatialRepresentationTypeCode
comment: method used to spatially represent geographic information
short name: spatRpType

language dataLang
type: DatatypeProperty
range: string
domain: MD DataIdentification
comment: language(s) used within the dataset
short name: dataLang

spatialResolution
type: ObjectProperty
domain: MD DataIdentification
range: MD Resolution
comment: factor which provides a general understanding of the density of spatial data in the dataset
short name: dataScale

TM PeriodDuration
type: Class
stereotypes: class

SI SpatialReferenceSystemUsingGeographicIdentifiers
type: Class
stereotypes: class
subclass of: RS ReferenceSystem
comment: documented in ISO 19112 – Spatial referencing by geographic identifiers
short name: SIRefSys

RS ReferenceSystem
type: Class
stereotypes: abstractClass
subclass of: Restriction
  cardinality: 1
  on property: name refSysName
subclass of: Restriction
  on property: domainOfValidity
  min cardinality: 0
comment: description of the spatial and temporal reference systems used in the dataset
short name: RefSys

Measure
type: Class
stereotypes: class

EX VerticalExtent
type: Class
stereotypes: class
subclass of: Restriction
  on property: minimumValue
  cardinality: 1
subclass of: Restriction
  on property: maximumValue
  cardinality: 1
subclass of: Restriction
  on property: unitOfMeasure
  cardinality: 1
subclass of: Restriction
  on property: verticalDatum
  cardinality: 1
comment: vertical domain of dataset
short name: VertExtent

minimumValue
type: DatatypeProperty
type: FunctionalProperty
domain: EX VerticalExtent
range: float
comment: lowest vertical extent contained in the dataset

maximumValue
type: DatatypeProperty
type: FunctionalProperty
domain: EX VerticalExtent
range: float
comment: highest vertical extent contained in the dataset
short name: vertMaxVal

unitOfMeasure
type: ObjectProperty
type: FunctionalProperty
domain: EX VerticalExtent
range: UomLength
comment: vertical units used for vertical extent information Examples: metres, feet, millimetres, hectopascals
short name: vertUoM

verticalDatum
type: ObjectProperty
type: FunctionalProperty
domain: EX VerticalExtent
range: SC VerticalDatum
comment: provides information about the origin from which the maximum and minimum elevation values are measured
short name: vertDatum

MD DigitalTransferOptions
type: Class
stereotypes: class
subclass of: Restriction
  on property: onLine onLineSrc
  min cardinality: 0
subclass of: Restriction
  on property: offLine
  min cardinality: 0
subclass of: Restriction
  on property: offLine
  max cardinality: 1
subclass of: Restriction
  on property: transferSize
  min cardinality: 0
subclass of: Restriction
  on property: transferSize
  max cardinality: 1
subclass of: Restriction
  on property: unitsOfDistribution
  min cardinality: 0
subclass of: Restriction
  on property: unitsOfDistribution
  max cardinality: 1
comment: technical means and media by which a resource is obtained from the distributor
short name: DigTranOps

onLine onLineSrc
type: ObjectProperty
comment: information about online sources from which the resource can be obtained
short name: onLineSrc
domain: MD DigitalTransferOptions
range: CI OnlineResource

offLine
type: ObjectProperty
type: FunctionalProperty
range: MD Medium
comment: information about offline media on which the resource can be obtained
short name: offLineMed
domain: MD DigitalTransferOptions

transferSize
type: DatatypeProperty
type: FunctionalProperty
range: float
comment: estimated size of a unit in the specified transfer format, expressed in megabytes. The transfer size is > 0.0
short name: transSize
domain: MD DigitalTransferOptions

unitsOfDistribution
type: DatatypeProperty
type: FunctionalProperty
range: string
comment: tiles, layers, geographic areas, etc., in which data is available
short name: unitsODist
domain: MD DigitalTransferOptions

MD ApplicationSchemaInformation
type: Class
stereotypes: class
subclass of: Restriction
  cardinality: 1
  on property: name asName
subclass of: Restriction
  on property: schemaLanguage
  cardinality: 1
subclass of: Restriction
  on property: constraintLanguage
  cardinality: 1
subclass of: Restriction
  on property: schemaAscii
  min cardinality: 0
subclass of: Restriction
  on property: schemaAscii
  max cardinality: 1
subclass of: Restriction
  on property: graphicsFile
  min cardinality: 0
subclass of: Restriction
  on property: graphicsFile
  max cardinality: 1
subclass of: Restriction
  on property: softwareDevelopmentFile
  min cardinality: 0
subclass of: Restriction
  on property: softwareDevelopmentFile
  max cardinality: 1
subclass of: Restriction
  on property: softwareDevelopmentFileFormat
  min cardinality: 0
subclass of: Restriction
  on property: softwareDevelopmentFileFormat
  max cardinality: 1
subclass of: Restriction
  on property: featureCatalogueSupplement
  cardinality: 1
comment: information about the application schema used to build the dataset
short name: AppSchInfo

name asName
type: ObjectProperty
type: FunctionalProperty
domain: MD ApplicationSchemaInformation
range: CI Citation
comment: name of the application schema used
short name: asName

schemaLanguage
type: DatatypeProperty
type: FunctionalProperty
range: string
domain: MD ApplicationSchemaInformation
comment: identification of the schema language used
short name: asSchLang

constraintLanguage
type: DatatypeProperty
type: FunctionalProperty
range: string
domain: MD ApplicationSchemaInformation
comment: formal language used in Application Schema
short name: asCstLang

schemaAscii
type: DatatypeProperty
type: FunctionalProperty
range: string
domain: MD ApplicationSchemaInformation
comment: full application schema given as an ASCII file
short name: asAscii

graphicsFile
type: DatatypeProperty
type: FunctionalProperty
range: string
domain: MD ApplicationSchemaInformation
comment: full application schema given as a graphics file
short name: asGraFile

softwareDevelopmentFile
type: FunctionalProperty
type: ObjectProperty
domain: MD ApplicationSchemaInformation
range: Binary
comment: full application schema given as a software development file
short name: asSwDevFile

softwareDevelopmentFileFormat
type: DatatypeProperty
type: FunctionalProperty
range: string
domain: MD ApplicationSchemaInformation
comment: software dependent format used for the application schema software dependent file
short name: asSwDevFiFt

featureCatalogueSupplement
type: FunctionalProperty
type: ObjectProperty
domain: MD ApplicationSchemaInformation
comment: information about the spatial attributes in the application schema for the feature types
short name: featCatSup
range: MD SpatialAttributeSupplement

EX TemporalExtent
type: Class
stereotypes: class
subclass of: Restriction
  cardinality: 1
  on property: extent exTemp
comment: time period covered by the content of the dataset
short name: TempExtent

extent exTemp
type: ObjectProperty
type: FunctionalProperty
domain: EX TemporalExtent
range: TM Primitive
comment: date and time for the content of the dataset
short name: exTemp

MemberName
type: Class
stereotypes: class

MD CRS
type: Class
stereotypes: class
subclass of: MD ReferenceSystem
subclass of: Restriction
  on property: projection
  min cardinality: 0
subclass of: Restriction
  on property: projection
  max cardinality: 1
subclass of: Restriction
  on property: ellipsoid
  min cardinality: 0
subclass of: Restriction
  on property: ellipsoid
  max cardinality: 1
subclass of: Restriction
  on property: datum
  min cardinality: 0
subclass of: Restriction
  on property: datum
  max cardinality: 1
subclass of: Restriction
  on property: projectionParameter
  min cardinality: 0
subclass of: Restriction
  on property: ellipsoidParameters
  min cardinality: 0
subclass of: Restriction
  on property: projectionParameter
  max cardinality: 1
subclass of: Restriction
  on property: ellipsoidParameters
  max cardinality: 1
short name: MdCoRefSys
comment: metadata about a coordinate system in which attributes have been derived from SC_CRS as defined in ISO 19111 – Spatial referencing by coordinates

MD ReferenceSystem
type: Class
stereotypes: class
subclass of: Restriction
  on property: referenceSystemIdentifier
  min cardinality: 0
subclass of: Restriction
  on property: referenceSystemIdentifier
  max cardinality: 1
subclass of: Restriction
  on property: referenceSystem
  cardinality: 1
comment: information about the reference system.

projection
type: FunctionalProperty
type: ObjectProperty
domain: MD CRS
range: RS Identifier
comment: identity of the projection used
short name: projection

ellipsoid
type: ObjectProperty
type: FunctionalProperty
domain: MD CRS
range: RS Identifier
comment: identity of the ellipsoid used
short name: ellipsoid

datum
type: ObjectProperty
type: FunctionalProperty
domain: MD CRS
range: RS Identifier
comment: Identity of the datum used
short name: datum

projectionParameter
type: FunctionalProperty
type: ObjectProperty
domain: MD CRS
range: MD ProjectionParameters
comment: set of parameters that describe the projection
short name: projParas

ellipsoidParameters
type: FunctionalProperty
type: ObjectProperty
domain: MD CRS
range: MD EllipsoidParameters
comment: set of parameters that describe the ellipsoid
short name: ellParas

DQ Result
type: Class
stereotypes: datatypeClass
comment: generalization of more specific result classes
short name: Result

purpose
type: DatatypeProperty
type: FunctionalProperty
range: string
domain: MD Identification
comment: summary of the intentions with which the resource(s) was developed
short name: idPurp

credit
type: DatatypeProperty
range: string
domain: MD Identification
comment: recognition of those who contributed to the resource(s)
short name: idCredit

status
type: ObjectProperty
domain: MD Identification
range: MD ProgressCode
comment: status of the resource(s)
short name: idStatus

pointOfConact
type: ObjectProperty
domain: MD Identification
range: CI ResponsibleParty
comment: identification of, and means of communication with, person(s) and organizations(s) associated with the resource(s)
short name: idPoC

resourceSpecificUsage
type: ObjectProperty
domain: MD Identification
range: MD Usage
short name: idSpecUse
comment: provides basic information about specific application(s) for which the resource(s) has/have been or is being used by different users

graphicOverview
type: ObjectProperty
domain: MD Identification
range: MD BrowseGraphics
comment: provides a graphic that illustrates the resource(s) (should include a legend for the graphic)
short name: graphOver

resourceFormat
type: ObjectProperty
domain: MD Identification
range: MD Format
comment: provides a description of the format of the resource(s)
short name: dsFormat

resourceMaintenance
type: ObjectProperty
domain: MD Identification
range: MD MaintenanceInformation
comment: provides information about the frequency of resource updates, and the scope of those updates
short name: resMaint

descriptiveKeywords
type: ObjectProperty
domain: MD Identification
range: MD Keywords
comment: provides category keywords, their type, and reference source
short name: descKeys

resourceConstraints
type: ObjectProperty
domain: MD Identification
range: MD Constraints
comment: provides information about constraints which apply to the resource(s)
short name: resConst

citation
type: ObjectProperty
type: FunctionalProperty
domain: MD Identification
range: CI Citation
comment: citation data for the resource(s)
short name: idCitation

abstract idAbs
type: DatatypeProperty
type: FunctionalProperty
range: string
domain: MD Identification
comment: brief narrative summary of the content of the resource(s)
short name: idAbs

MD PortrayalCatalogueReference
type: Class
stereotypes: class
subclass of: Restriction
  on property: portrayalCatalogueCitation
  min cardinality: 1
subclass of: Restriction
  on property: portrayalCatalogueCitation
  min cardinality: 1
comment: information identifying the portrayal catalogue used
short name: PortCatRef

portrayalCatalogueCitation
type: ObjectProperty
domain: MD PortrayalCatalogueReference
range: CI Citation
comment: bibliographic reference to the portrayal catalogue cited
short name: portCatCit

DQ TemporalValidity
type: Class
stereotypes: class
subclass of: DQ TemporalAccuracy
comment: validity of data specified by the scope with respect to time
short name: DQTempValid

DQ TemporalAccuracy
type: Class
stereotypes: abstractClass
subclass of: DQ Element
comment: accuracy of the temporal attributes and temporal relationships of features
short name: DQTempAcc

SC CRS
type: Class
stereotypes: abstractClass
subclass of: RS ReferenceSystem
comment: documented in ISO 19111 – Spatial referencing by coordinates
short name: SCRefSys

MD RestrictionCode
type: Class
stereotypes: codelist
domain code: RestrictCd
comment: limitation(s) placed upon the access or use of the data
equivalent class: Class
  one of: copyright
  one of: patent
  one of: patentPending
  one of: trademark
  one of: license
  one of: intellectualPropertyrights
  one of: restricted
  one of: otherRestrictions

copyright
type: MD RestrictionCode
domain code: 001
comment: exclusive right to the publication, production, or sale of the rights to a literary, dramatic, musical, or artistic work, or to the use of a commercial print or label, granted by law for a specified period of time to an author, composer, artist, distributor

patent
type: MD RestrictionCode
domain code: 002
comment: government has granted exclusive right to make, sell, use or license an invention or discovery

patentPending
type: MD RestrictionCode
domain code: 003
comment: produced or sold information awaiting a patent

trademark
type: MD RestrictionCode
domain code: 004
comment: a name, symbol, or other device identifying a product, officially registered and legally restricted to the use of the owner or manufacturer

license
type: MD RestrictionCode
domain code: 005
comment: formal permission to do something

intellectualPropertyrights
type: MD RestrictionCode
domain code: 006
comment: rights to financial benefit from and control of distribution of non-tangible property that is a result of creativity

restricted
type: MD RestrictionCode
domain code: 007
comment: withheld from general circulation or disclosure

otherRestrictions
type: MD RestrictionCode
domain code: 008
comment: limitation not listed

CI PresentationFormCode
type: Class
stereotypes: codelist
domain code: PresFormCd
comment: mode in which the data is represented
equivalent class: Class
  one of: documentDigital
  one of: documentHardcopy
  one of: imageDigital
  one of: imageHardCopy
  one of: mapDigital
  one of: mapHardCopy
  one of: modelDigital
  one of: modelHardcopy
  one of: profileDigital
  one of: profileHardcopy
  one of: tableDigital
  one of: tableHardcopy
  one of: videoDigital
  one of: videoHardcopy

documentDigital
type: CI PresentationFormCode
domain code: 001
comment: digital representation of a primarily textual item (can contain illustrations also)

documentHardcopy
type: CI PresentationFormCode
domain code: 002
comment: representation of a primarily textual item (can contain illustrations also) on paper, photographic material, or other media

imageDigital
type: CI PresentationFormCode
domain code: 003
comment: likeness of natural or man-made features, objects, and activities acquired through the sensing of visual or any other segment of the electromagnetic spectrum by sensors, such as thermal infrared, and high resolution radar and stored in digital format

imageHardCopy
type: CI PresentationFormCode
domain code: 004
comment: likeness of natural or man-made features, objects, and activities acquired through the sensing of visual or any other segment of the electromagnetic spectrum by sensors, such as thermal infrared, and high resolution radar and reproduced on paper, photographic material, or other media for use directly by the human user

mapDigital
type: CI PresentationFormCode
domain code: 005
comment: map represented in raster or vector form

mapHardCopy
type: CI PresentationFormCode
domain code: 006
comment: map printed on paper, photographic material, or other media for use directly by the human user

modelDigital
type: CI PresentationFormCode
domain code: 007
comment: multi-dimensional digital representation of a feature, process, etc.

modelHardcopy
type: CI PresentationFormCode
domain code: 008
comment: 3-dimensional, physical model

profileDigital
type: CI PresentationFormCode
domain code: 009
comment: vertical cross-section in digital form

profileHardcopy
type: CI PresentationFormCode
domain code: 010
comment: vertical cross-section printed on paper, etc.

tableDigital
type: CI PresentationFormCode
domain code: 012
comment: digital representation of facts or figures systematically displayed, especially in columns

tableHardcopy
type: CI PresentationFormCode
domain code: 012
comment: representation of facts or figures systematically displayed, especially in columns, printed on paper, photographic material, or other media

videoDigital
type: CI PresentationFormCode
domain code: 013
comment: digital video recording

videoHardcopy
type: CI PresentationFormCode
domain code: 014
comment: video recording on film

GF FeatureType
type: Class
stereotypes: class

EX Extent
type: Class
stereotypes: dataypeClass
subclass of: Restriction
  min cardinality: 0
  on property: description exDesc
subclass of: Restriction
  on property: geographicElement
  min cardinality: 0
subclass of: Restriction
  on property: temporalElement
  min cardinality: 0
subclass of: Restriction
  on property: verticalElement
  min cardinality: 0
subclass of: Restriction
  max cardinality: 1
  on property: description exDesc
comment: information about spatial, vertical, and temporal extent
short name: Extent

description exDesc
type: DatatypeProperty
type: FunctionalProperty
range: string
domain: EX Extent
condition: geographicElement and temporalElement and verticalElement not documented ?
comment: spatial and temporal extent for the referring object
short name: exDesc

geographicElement
type: ObjectProperty
domain: EX Extent
range: EX GeographicExtent
condition: description and temporalElement and verticalElement not documented ?
comment: provides geographic component of the extent of the referring object
short name: geoEle

temporalElement
type: ObjectProperty
domain: EX Extent
range: EX TemporalExtent
condition: description and geographicElement and verticalElement not documented ?
comment: provides temporal component of the extent of the referring object
short name: tempEle

verticalElement
type: ObjectProperty
domain: EX Extent
range: EX VerticalExtent
condition: description, geographicElement and temporalElement not documented ?
comment: provides vertical component of the extent of the referring object
short name: vertEle

DQ EvaluationMethodTypeCode
type: Class
stereotypes: codelist
domain code: EvalMethTypeCd
comment: type of method for evaluating an identified data quality measure
equivalent class: Class
  one of: directInternal
  one of: directExternal
  one of: indirect

directInternal
type: DQ EvaluationMethodTypeCode
domain code: 001
comment: method of evaluating the quality of a dataset based on inspection of items within the dataset, where all data required is internal to the dataset being evaluated

directExternal
type: DQ EvaluationMethodTypeCode
domain code: 002
comment: method of evaluating the quality of a dataset based on inspection of items within the dataset, where reference data external to the dataset being evaluated is required

indirect
type: DQ EvaluationMethodTypeCode
domain code: 003
comment: method of evaluating the quality of a dataset based on external knowledge

CI Citation
type: Class
stereotypes: datatypeClass
subclass of: Restriction
  min cardinality: 1
  on property: date resRefDate
subclass of: Restriction
  on property: edition
  min cardinality: 0
subclass of: Restriction
  on property: ISBN
  min cardinality: 0
subclass of: Restriction
  on property: ISSN
  min cardinality: 0
subclass of: Restriction
  on property: collectiveTitle
  min cardinality: 0
subclass of: Restriction
  on property: otherCitationDetails
  min cardinality: 0
subclass of: Restriction
  min cardinality: 0
  on property: series datasetSeries
subclass of: Restriction
  on property: presentationForm
  min cardinality: 0
subclass of: Restriction
  on property: citedResponsibleParty
  min cardinality: 0
subclass of: Restriction
  on property: identifierType
  min cardinality: 0
subclass of: Restriction
  on property: identifier
  min cardinality: 0
subclass of: Restriction
  on property: editionDate
  min cardinality: 0
subclass of: Restriction
  on property: title
  cardinality: 1
subclass of: Restriction
  on property: edition
  max cardinality: 1
subclass of: Restriction
  on property: editionDate
  max cardinality: 1
subclass of: Restriction
  max cardinality: 1
  on property: series datasetSeries
subclass of: Restriction
  on property: ISBN
  max cardinality: 1
subclass of: Restriction
  on property: ISSN
  max cardinality: 1
subclass of: Restriction
  on property: collectiveTitle
  max cardinality: 1
subclass of: Restriction
  on property: otherCitationDetails
  max cardinality: 1
subclass of: Restriction
  on property: alternateTitle
  min cardinality: 0
comment: standardized resource reference
short name: Citation

date resRefDate
type: ObjectProperty
domain: CI Citation
range: CI Date
comment: reference date for the cited resource
short name: resRefDate

edition
type: DatatypeProperty
type: FunctionalProperty
range: string
domain: CI Citation
comment: version of the cited resource
short name: resEd

ISBN
type: DatatypeProperty
type: FunctionalProperty
range: string
domain: CI Citation
comment: international Standard Book Number
short name: isbn

ISSN
type: DatatypeProperty
type: FunctionalProperty
range: string
domain: CI Citation
comment: international Standard Serial Number
short name: issn

collectiveTitle
type: DatatypeProperty
type: FunctionalProperty
range: string
domain: CI Citation
comment: common title with holdings note NOTE title identifies elements of a series collectively, combined with information about what volumes are available at the source cited
short name: collTitle

otherCitationDetails
type: DatatypeProperty
type: FunctionalProperty
range: string
domain: CI Citation
comment: other information required to complete the citation that is not recorded elsewhere
short name: otherCitDet

series datasetSeries
type: ObjectProperty
type: FunctionalProperty
domain: CI Citation
range: CI Series
comment: information about the series, or aggregate dataset, of which the dataset is a part
short name: datasetSeries

presentationForm
type: ObjectProperty
domain: CI Citation
range: CI PresentationFormCode
comment: mode in which the resource is represented
short name: presForm

citedResponsibleParty
type: ObjectProperty
domain: CI Citation
range: CI ResponsibleParty
comment: name and position information for an individual or organization that is responsible for the resource
short name: citRespParty

identifierType
type: DatatypeProperty
range: string
domain: CI Citation
comment: reference form of the unique identifier (ID) Example: Universal Product Code (UPC), National Stock Number (NSN)
short name: citIdType

identifier
type: DatatypeProperty
range: string
domain: CI Citation
comment: unique identifier for the resource EXAMPLE: Universal Product Code (UPC), National Stock Number (NSN)
short name: citId

editionDate
type: FunctionalProperty
type: ObjectProperty
domain: CI Citation
range: Date
comment: date of the edition
short name: resEdDate

title
type: DatatypeProperty
type: FunctionalProperty
range: string
domain: CI Citation
comment: name by which the cited resource is known
short name: resTitle

alternateTitle
type: DatatypeProperty
range: string
domain: CI Citation
comment: short name or other language name by which the cited information is known. Example: "DCW" as an alternative title for "Digital Chart of the World
short name: resAltTitle

Record
type: Class
stereotypes: class

DQ LogicalConsistency
type: Class
stereotypes: abstractClass
subclass of: DQ Element
comment: degree of adherence to logical rules of data structure, attribution and relationships (data structure can be conceptual, logical or physical)
short name: DQLogConsis

DQ Element
type: Class
stereotypes: abstractClass
subclass of: Restriction
  on property: result
  min cardinality: 1
subclass of: Restriction
  min cardinality: 0
  on property: dateTime measDateTm
subclass of: Restriction
  on property: evaluationProcedure
  min cardinality: 0
subclass of: Restriction
  on property: evaluationMethodType
  min cardinality: 0
subclass of: Restriction
  on property: evaluationMethodDescription
  min cardinality: 0
subclass of: Restriction
  on property: measureIdentification
  min cardinality: 0
subclass of: Restriction
  on property: measureDescription
  min cardinality: 0
subclass of: Restriction
  on property: nameOfMeasure
  min cardinality: 0
subclass of: Restriction
  on property: result
  max cardinality: 2
subclass of: Restriction
  max cardinality: 1
  on property: dateTime measDateTm
subclass of: Restriction
  on property: evaluationMethodDescription
  max cardinality: 1
subclass of: Restriction
  on property: evaluationMethodType
  max cardinality: 1
subclass of: Restriction
  on property: evaluationProcedure
  max cardinality: 1
subclass of: Restriction
  on property: measureDescription
  max cardinality: 1
subclass of: Restriction
  on property: measureIdentification
  max cardinality: 1
comment: type of test applied to the data specified by a data quality scope
short name: DQElement

MD MediumNameCode
type: Class
stereotypes: codelist
domain code: MedNameCd
comment: name of the medium
equivalent class: Class
  one of: cdRom
  one of: dvd
  one of: dvdRom
  one of: 3halfIncFloppy
  one of: 5quarterInchFloppy
  one of: 7trackTape
  one of: 9trackTape
  one of: 3480Cartidge
  one of: 3490Cartidge
  one of: 3580Cartidge
  one of: 4mmCartidge
  one of: 8mmCartidge
  one of: 1quarterInchCartidgeTape
  one of: digitalLinearTape
  one of: onLine MedName
  one of: satellite
  one of: telephoneLink
  one of: hardcopy

cdRom
type: MD MediumNameCode
domain code: 001
comment: read-only optical disk

dvd
type: MD MediumNameCode
domain code: 002
comment: digital versatile disk

dvdRom
type: MD MediumNameCode
domain code: 003
comment: digital versatile disk, read only

3halfIncFloppy
type: MD MediumNameCode
domain code: 004
comment: 3,5 inch magnetic disk

5quarterInchFloppy
type: MD MediumNameCode
domain code: 005
comment: 5,25 inch magnetic disk

7trackTape
type: MD MediumNameCode
domain code: 006
comment: 7 track magnetic tape

9trackTape
type: MD MediumNameCode
domain code: 007
comment: 9 track magnetic tape

3480Cartidge
type: MD MediumNameCode
domain code: 008
comment: 3480 cartridge tape drive

3490Cartidge
type: MD MediumNameCode
domain code: 009
comment: 3490 cartridge tape drive

3580Cartidge
type: MD MediumNameCode
domain code: 010
comment: 3580 cartridge tape drive

4mmCartidge
type: MD MediumNameCode
domain code: 011
comment: 4 millimetre magnetic tape

8mmCartidge
type: MD MediumNameCode
domain code: 012
comment: 8 millimetre magnetic tape

1quarterInchCartidgeTape
type: MD MediumNameCode
domain code: 013
comment: 0,25 inch magnetic tape

digitalLinearTape
type: MD MediumNameCode
domain code: 014
comment: half inch cartridge streaming tape drive

onLine MedName
type: MD MediumNameCode
domain code: 015
comment: direct computer linkage

satellite
type: MD MediumNameCode
domain code: 016
comment: linkage through a satellite communication system

telephoneLink
type: MD MediumNameCode
domain code: 017
comment: communication through a telephone network

hardcopy
type: MD MediumNameCode
domain code: 018
comment: pamphlet or leaflet giving descriptive information

MD ObligationCode
type: Class
domain code: ObCd
stereotypes: enumeration
comment: obligation of the element or entity
equivalent class: Class
  one of: mandatory
  one of: optional
  one of: conditional

mandatory
type: MD ObligationCode
domain code: 001
comment: element is always required

optional
type: MD ObligationCode
domain code: 002
comment: element is not required

conditional
type: MD ObligationCode
domain code: 003
comment: element is required when specific a specific condition is met

MD MaintenanceInformation
type: Class
stereotypes: class
subclass of: Restriction
  on property: maintenanceNote
  min cardinality: 0
subclass of: Restriction
  on property: updateScopeDescription
  min cardinality: 0
subclass of: Restriction
  on property: updateScope
  min cardinality: 0
subclass of: Restriction
  on property: userDefinedMaintenanceFrequency
  min cardinality: 0
subclass of: Restriction
  on property: dateOfNextUpdate
  min cardinality: 0
subclass of: Restriction
  on property: maintenanceAndUpdateFrequency
  cardinality: 1
subclass of: Restriction
  on property: dateOfNextUpdate
  max cardinality: 1
subclass of: Restriction
  on property: userDefinedMaintenanceFrequency
  max cardinality: 1
comment: information about the scope and frequency of updating
short name: MaintInfo

maintenanceNote
type: DatatypeProperty
range: string
domain: MD MaintenanceInformation
comment: information regarding specific requirements for maintaining the resource
short name: maintNote

updateScopeDescription
type: ObjectProperty
domain: MD MaintenanceInformation
range: MD ScopeDescription
comment: additional information about the range or extent of the resource
short name: upScpDesc

updateScope
type: ObjectProperty
domain: MD MaintenanceInformation
range: MD ScopeCode
comment: scope of data to which maintenance is applied
short name: maintScp

userDefinedMaintenanceFrequency
type: FunctionalProperty
type: ObjectProperty
domain: MD MaintenanceInformation
range: TM PeriodDuration
comment: maintenance period other than those defined
short name: usrDefFreq

dateOfNextUpdate
type: ObjectProperty
type: FunctionalProperty
domain: MD MaintenanceInformation
range: Date
comment: scheduled revision date for resource
short name: dateNext

maintenanceAndUpdateFrequency
type: ObjectProperty
type: FunctionalProperty
domain: MD MaintenanceInformation
range: MD MaintenanceFrequenceCode
comment: frequency with which changes and additions are made to the resource after the initial resource is completed
short name: maintFreq

CI OnlineResource
type: Class
stereotypes: datatypeClass
subclass of: Restriction
  on property: linkage
  cardinality: 1
subclass of: Restriction
  on property: protocol
  min cardinality: 0
subclass of: Restriction
  on property: function
  min cardinality: 0
subclass of: Restriction
  min cardinality: 0
  on property: name onlName
subclass of: Restriction
  on property: applicationProfile
  min cardinality: 0
subclass of: Restriction
  on property: protocol
  max cardinality: 1
subclass of: Restriction
  on property: applicationProfile
  max cardinality: 1
subclass of: Restriction
  max cardinality: 1
  on property: name onlName
subclass of: Restriction
  min cardinality: 0
  on property: description orDesc
subclass of: Restriction
  max cardinality: 1
  on property: description orDesc
subclass of: Restriction
  on property: function
  max cardinality: 1
comment: information about on-line sources from which the dataset, specification, or community profile name and extended metadata elements can be obtained
short name: OnlineRes

linkage
type: ObjectProperty
type: FunctionalProperty
domain: CI OnlineResource
range: URL
comment: location (address) for on-line access using a Uniform Resource Locator address or similar addressing scheme such as http://www.statkart.no/isotc211
short name: linkage

protocol
type: DatatypeProperty
type: FunctionalProperty
range: string
domain: CI OnlineResource
comment: connection protocol to be used
short name: protocol

function
type: ObjectProperty
type: FunctionalProperty
domain: CI OnlineResource
range: CI OnLineFunctionCode
comment: code for function performed by the online resource
short name: orFunct

name onlName
type: DatatypeProperty
type: FunctionalProperty
range: string
domain: CI OnlineResource
comment: name of the online resource
short name: orName

applicationProfile
type: DatatypeProperty
type: FunctionalProperty
range: string
domain: CI OnlineResource
comment: name of an application profile that can be used with the online resource
short name: appProfile

description orDesc
type: DatatypeProperty
type: FunctionalProperty
range: string
domain: CI OnlineResource
comment: detailed text description of what the online resource is/does
short name: orDesc

MD FeatureCatalogueDescription
type: Class
stereotypes: class
subclass of: MD ContentInformation
subclass of: Restriction
  on property: complianceCode
  min cardinality: 0
subclass of: Restriction
  on property: complianceCode
  max cardinality: 1
subclass of: Restriction
  min cardinality: 0
  on property: language catLang
subclass of: Restriction
  on property: includeWithDataset
  cardinality: 1
subclass of: Restriction
  on property: featureTypes
  min cardinality: 0
subclass of: Restriction
  on property: featureCatalogueCitation
  min cardinality: 0
comment: information identifying the feature catalogue
short name: FetCatDesc

MD ContentInformation
type: Class
stereotypes: class
comment: description of the content of a dataset
short name: ContInfo

complianceCode
type: DatatypeProperty
type: FunctionalProperty
domain: MD FeatureCatalogueDescription
range: boolean
comment: indication of whether or not the cited feature catalogue complies with ISO 19110
short name: compCode

language catLang
type: DatatypeProperty
type: FunctionalProperty
range: string
domain: MD FeatureCatalogueDescription
comment: language(s) used within the catalogue
short name: catLang

includeWithDataset
type: DatatypeProperty
type: FunctionalProperty
domain: MD FeatureCatalogueDescription
range: boolean
comment: indication of whether or not the feature catalogue is included with the dataset
short name: incWithDS

featureTypes
type: ObjectProperty
domain: MD FeatureCatalogueDescription
range: GenericName
comment: subset of feature types from cited feature catalogue occurring in dataset
short name: catFetTyps

featureCatalogueCitation
type: ObjectProperty
domain: MD FeatureCatalogueDescription
comment: complete bibliographic reference to one or more external feature catalogues
range: CI Citation
short name: catCitation

Distance
type: Class
stereotypes: class

MD Distributor
type: Class
stereotypes: class
subclass of: Restriction
  on property: distributorContact
  cardinality: 1
subclass of: Restriction
  on property: distributionOrderProcess
  min cardinality: 0
subclass of: Restriction
  on property: distributionTransferOptions
  min cardinality: 0
subclass of: Restriction
  on property: distributorFormat
  min cardinality: 0
comment: information about the distributor
short name: Distributor

distributorContact
type: ObjectProperty
type: FunctionalProperty
domain: MD Distributor
range: CI ResponsibleParty
comment: party from whom the resource may be obtained. This list need not be exhaustive
short name: distorCont

distributionOrderProcess
type: ObjectProperty
domain: MD Distributor
range: MD StandardOrderProcess
comment: provides information about how the resource may be obtained, and related instructions and fee information
short name: distorOrdPrc

distributionTransferOptions
type: ObjectProperty
domain: MD Distributor
comment: provides information about the technical means and media used by the distributor
short name: distorTran
range: MD DigitalTransferOptions

distributorFormat
type: ObjectProperty
domain: MD Distributor
range: MD Format
condition: MD_Distribution.distributionFormat not documented ?
comment: provides information about the format used by the distributor
short name: distorFormat

MD KeywordTypeCode
type: Class
stereotypes: codelist
domain code: KeyTypCd
comment: methods used to group similar keywords
equivalent class: Class
  one of: discipline
  one of: place
  one of: stratum
  one of: temporal
  one of: theme

discipline
type: MD KeywordTypeCode
domain code: 001
comment: keyword identifies a branch of instruction or specialized learning

place
type: MD KeywordTypeCode
domain code: 002
comment: keyword identifies a location

stratum
type: MD KeywordTypeCode
domain code: 003
comment: keyword identifies the layer(s) of any deposited substance

temporal
type: MD KeywordTypeCode
domain code: 004
comment: keyword identifies a time period related to the dataset

theme
type: MD KeywordTypeCode
domain code: 005
comment: keyword identifies a particular subject or topic

DQ AbsoluteExtermalPositionalAccuracy
type: Class
stereotypes: class
subclass of: DQ PositionAccuracy
comment: closeness of reported coordinate values to values accepted as or being true
short name: DQAbsExtPosAcc

DQ PositionAccuracy
type: Class
stereotypes: abstractClass
subclass of: DQ Element
comment: accuracy of the position of features
short name: DQPosAcc

MD GeometricObjectTypeCode
type: Class
stereotypes: codelist
domain code: GeoObjTypCd
comment: name of point and vector spatial objects used to locate zero-, one-, and two-dimensional spatial locations in the dataset
equivalent class: Class
  one of: complexes
  one of: composites
  one of: curve
  one of: point GeoObjTypCd
  one of: solid
  one of: surface

complexes
type: MD GeometricObjectTypeCode
domain code: 001
comment: set of geometric primitives such that their boundaries can be represented as a union of other primitives

composites
type: MD GeometricObjectTypeCode
domain code: 002
comment: connected set of curves, solids or surfaces

curve
type: MD GeometricObjectTypeCode
domain code: 003
comment: bounded, 1-dimensional geometric primitive, representing the continuous image of a line

point GeoObjTypCd
type: MD GeometricObjectTypeCode
domain code: 004
comment: zero-dimensional geometric primitive, representing a position but not having an extent

solid
type: MD GeometricObjectTypeCode
domain code: 005
comment: bounded, connected 3-dimensional geometric primitive, representing the continuous image of a region of space

surface
type: MD GeometricObjectTypeCode
domain code: 006
comment: bounded, connected 2-dimensional geometric, representing the continuous image of a region of a plane

MD ObliqueLineAzimuth
type: Class
stereotypes: class
subclass of: Restriction
  on property: azimuthAngle
  cardinality: 1
subclass of: Restriction
  on property: azimuthMeasurePointLongitude
  cardinality: 1
comment: method used to describe the line along which an oblique mercator map projection is centred using the map projection origin and an azimuth
short name: ObLineAzi

azimuthAngle
type: DatatypeProperty
type: FunctionalProperty
domain: MD ObliqueLineAzimuth
range: float
comment: angle measured clockwise from north, and expressed in degrees
short name: aziAngle

azimuthMeasurePointLongitude
type: DatatypeProperty
type: FunctionalProperty
domain: MD ObliqueLineAzimuth
range: float
comment: longitude of the map projection origin
short name: aziPtLong

MD GeometricObjects
type: Class
stereotypes: datatypeClass
subclass of: Restriction
  on property: geometricObjectType
  cardinality: 1
subclass of: Restriction
  on property: geometricObjectCount
  min cardinality: 0
subclass of: Restriction
  on property: geometricObjectCount
  max cardinality: 1
comment: number of objects, listed by geometric object type, used in the dataset
short name: GeometObjs

geometricObjectType
type: ObjectProperty
type: FunctionalProperty
domain: MD GeometricObjects
comment: name of point and vector spatial objects used to locate zero-, one-, and two-dimensional spatial locations in the dataset
range: MD GeometricObjectTypeCode
short name: geoObjTyp

geometricObjectCount
type: DatatypeProperty
type: FunctionalProperty
domain: MD GeometricObjects
range: int
comment: total number of the point or vector object type occurring in the dataset
short name: geoObjCnt

DS AssociationTypeCode
type: Class
stereotypes: codelist
domain code: AscTypeCd
comment: justification for the correlation of two datasets
equivalent class: Class
  one of: crossReference
  one of: largerWorkCitation
  one of: partOfSeamlessDatabase
  one of: source
  one of: stereomate

crossReference
type: DS AssociationTypeCode
domain code: 001
comment: reference from one dataset to another

largerWorkCitation
type: DS AssociationTypeCode
domain code: 002
comment: reference to a master dataset of which this one is a part

partOfSeamlessDatabase
type: DS AssociationTypeCode
domain code: 003
comment: part of same structured set of data held in a computer

source
type: DS AssociationTypeCode
domain code: 004
comment: mapping and charting information from which the dataset content originates

stereomate
type: DS AssociationTypeCode
domain code: 005
comment: part of a set of imagery that when used together, provides three-dimensional images

MD Dimension
type: Class
stereotypes: datatypeClass
subclass of: Restriction
  on property: dimensionName
  cardinality: 1
subclass of: Restriction
  on property: dimensionSize
  cardinality: 1
subclass of: Restriction
  on property: resolution
  min cardinality: 1
subclass of: Restriction
  on property: resolution
  max cardinality: 1
comment: axis properties
short name: Dimen

dimensionName
type: ObjectProperty
type: FunctionalProperty
domain: MD Dimension
comment: name of the axis
range: MD DimensionNameTypeCode
short name: dimName

dimensionSize
type: DatatypeProperty
type: FunctionalProperty
domain: MD Dimension
range: int
comment: number of elements along the axis
short name: dimSize

resolution
type: ObjectProperty
type: FunctionalProperty
domain: MD Dimension
comment: degree of detail in the grid dataset
range: Measure
short name: dimResol

MD MediumFormatCode
type: Class
stereotypes: codelist
equivalent class: Class
  one of: cpio
  one of: tar
  one of: highSierra
  one of: iso9660
  one of: iso9660RockRidge
  one of: iso9660AppleHFS
comment: method used to write to the medium

cpio
type: MD MediumFormatCode
domain code: 001
comment: Copy In/ Out (Unix file format and command)

tar
type: MD MediumFormatCode
domain code: 002
comment: Tap ARchive

highSierra
type: MD MediumFormatCode
domain code: 003
comment: high sierra file system

iso9660
type: MD MediumFormatCode
domain code: 004
comment: information processing - volume and file structure of CD- ROM

iso9660RockRidge
type: MD MediumFormatCode
domain code: 005
comment: rock ridge interchange protocol (UNIX)

iso9660AppleHFS
type: MD MediumFormatCode
domain code: 006
comment: hierarchical file system

DQ AccuracyOfATimeMeasurement
type: Class
stereotypes: class
subclass of: DQ TemporalAccuracy
comment: correctness of the temporal references of an item (reporting of error in time measurement)
short name: DQAccTimeMeas

MD ImageDescription
type: Class
stereotypes: class
subclass of: MD CoverageDescription
subclass of: Restriction
  on property: illuminationAzimuthAngle
  min cardinality: 0
subclass of: Restriction
  on property: illuminationElevationAngle
  min cardinality: 0
subclass of: Restriction
  on property: illuminationAzimuthAngle
  max cardinality: 1
subclass of: Restriction
  on property: illuminationElevationAngle
  max cardinality: 1
subclass of: Restriction
  on property: imagingCondition
  min cardinality: 0
subclass of: Restriction
  on property: imagingCondition
  max cardinality: 1
subclass of: Restriction
  on property: lenseDistortionInformationAvailibility
  min cardinality: 0
subclass of: Restriction
  on property: lenseDistortionInformationAvailibility
  max cardinality: 1
subclass of: Restriction
  on property: filmDistortionInformationAvailibility
  min cardinality: 0
subclass of: Restriction
  on property: filmDistortionInformationAvailibility
  max cardinality: 1
subclass of: Restriction
  min cardinality: 0
  on property: cameraCalibrationInformationAvailability
subclass of: Restriction
  max cardinality: 1
  on property: cameraCalibrationInformationAvailability
subclass of: Restriction
  on property: radiometricCalibrationDataAvailability
  min cardinality: 0
subclass of: Restriction
  on property: radiometricCalibrationDataAvailability
  max cardinality: 1
subclass of: Restriction
  on property: triangulationIndicator
  min cardinality: 0
subclass of: Restriction
  on property: triangulationIndicator
  max cardinality: 1
subclass of: Restriction
  on property: compressionGenerationQuantity
  min cardinality: 0
subclass of: Restriction
  on property: compressionGenerationQuantity
  max cardinality: 1
subclass of: Restriction
  on property: processingLevelCode
  min cardinality: 0
subclass of: Restriction
  on property: processingLevelCode
  max cardinality: 1
subclass of: Restriction
  on property: cloudCoverPercentage
  min cardinality: 0
subclass of: Restriction
  on property: cloudCoverPercentage
  max cardinality: 1
subclass of: Restriction
  on property: imageQualityCode
  min cardinality: 0
subclass of: Restriction
  on property: imageQualityCode
  max cardinality: 1
comment: information about an image’s suitability for use
short name: ImgDesc

MD CoverageDescription
type: Class
stereotypes: class
subclass of: MD ContentInformation
comment: information about the content of a grid data cell
short name: CovDesc
subclass of: Restriction
  on property: contentType
  cardinality: 1
subclass of: Restriction
  on property: attributeDescription
  cardinality: 1
subclass of: Restriction
  on property: dimension
  min cardinality: 0

illuminationAzimuthAngle
type: DatatypeProperty
type: FunctionalProperty
domain: MD ImageDescription
range: float
comment: illumination azimuth measured in degrees clockwise from true north at the time the image is taken. For images from a scanning device, refer to the centre pixel of the image
short name: illAziAng

illuminationElevationAngle
type: DatatypeProperty
type: FunctionalProperty
domain: MD ImageDescription
range: float
comment: illumination elevation measured in degrees clockwise from the target plane at intersection of the optical line of sight with the Earth’s surface. For images from a scanning device, refer to the centre pixel of the image
short name: illElevAng

imagingCondition
type: ObjectProperty
type: FunctionalProperty
domain: MD ImageDescription
comment: conditions affected the image
range: MD ImagingConditionCode
short name: imagCond

lenseDistortionInformationAvailibility
type: DatatypeProperty
type: FunctionalProperty
domain: MD ImageDescription
range: boolean
comment: indication of whether or not lens aberration correction information is available
short name: lensDistInAv

filmDistortionInformationAvailibility
type: DatatypeProperty
type: FunctionalProperty
domain: MD ImageDescription
range: boolean
comment: indication of whether or not Calibration Reseau information is available
short name: filmDistInAv

cameraCalibrationInformationAvailability
type: DatatypeProperty
type: FunctionalProperty
domain: MD ImageDescription
range: boolean
comment: indication of whether or not constants are available which allow for camera calibration corrections
short name: camCalInAv

radiometricCalibrationDataAvailability
type: DatatypeProperty
type: FunctionalProperty
domain: MD ImageDescription
range: boolean
comment: indication of whether or not the radiometric calibration information for generating the radiometrically calibrated standard data product is available
short name: radCalDatAv

triangulationIndicator
type: DatatypeProperty
type: FunctionalProperty
domain: MD ImageDescription
range: boolean
comment: indication of whether or not triangulation has been performed upon the image
short name: trianInd

compressionGenerationQuantity
type: DatatypeProperty
type: FunctionalProperty
domain: MD ImageDescription
range: int
comment: count of the number the number of lossy compression cycles performed on the image
short name: cmpGenQuan

processingLevelCode
type: ObjectProperty
type: FunctionalProperty
domain: MD ImageDescription
comment: image distributor’s code that identifies the level of radiometric and geometric processing that has been applied
range: MD Identifier
short name: prcTypCde

cloudCoverPercentage
type: DatatypeProperty
type: FunctionalProperty
domain: MD ImageDescription
range: float
comment: area of the dataset obscured by clouds, expressed as a percentage of the spatial extent
short name: cloudCovPer

imageQualityCode
type: ObjectProperty
type: FunctionalProperty
domain: MD ImageDescription
comment: specifies the image quality
range: MD Identifier
short name: imagQuCode

EX BoundingPolygon
type: Class
stereotypes: class
subclass of: EX GeographicExtent
subclass of: Restriction
  min cardinality: 1
  on property: polygon polygon
comment: boundary enclosing the dataset, expressed as the closed set of (x,y) coordinates of the polygon (last point replicates first point)
subclass of: Restriction
  min cardinality: 1
  on property: polygon polygon
short name: BoundPoly

EX GeographicExtent
type: Class
stereotypes: abstractClass
subclass of: Restriction
  on property: extentTypeCode
  min cardinality: 0
subclass of: Restriction
  on property: extentTypeCode
  max cardinality: 1
comment: geographic area of the dataset
short name: GeoExtent

polygon polygon
type: ObjectProperty
domain: EX BoundingPolygon
comment: sets of points defining the bounding polygon
range: GM Object
short name: polygon

GM Point
type: Class
stereotypes: class

GF AttributeType
type: Class
stereotypes: class

CI Series
type: Class
stereotypes: datatypeClass
subclass of: Restriction
  min cardinality: 0
  on property: name seriesName
subclass of: Restriction
  on property: issuedIdentification
  min cardinality: 0
subclass of: Restriction
  on property: page
  min cardinality: 0
subclass of: Restriction
  max cardinality: 1
  on property: name seriesName
subclass of: Restriction
  on property: issuedIdentification
  max cardinality: 1
subclass of: Restriction
  on property: page
  max cardinality: 1
comment: information about the series, or aggregate dataset, to which a dataset belongs
short name: DatasetSeries

name seriesName
type: FunctionalProperty
type: DatatypeProperty
domain: CI Series
range: string
comment: name of the series, or aggregate dataset, of which the dataset is a part
short name: seriesName

issuedIdentification
type: DatatypeProperty
type: FunctionalProperty
range: string
domain: CI Series
comment: information identifying the issue of the series
short name: issId

page
type: DatatypeProperty
type: FunctionalProperty
range: string
domain: CI Series
comment: details on which pages of the publication the article was published
short name: artPage

DQ CompletenessOmission
type: Class
stereotypes: class
subclass of: DQ Completeness
comment: data absent from the dataset, as described by the scope
short name: DQCompOm

DQ Completeness
type: Class
stereotypes: abstractClass
subclass of: DQ Element
comment: presence and absence of features, their attributes and their relationships
short name: DQComplete

MD Metadata
type: Class
stereotypes: class
short name: Metadata
comment: root entity which defines metadata about a resource or resources
subclass of: Restriction
  on property: filedIdentifier
  min cardinality: 0
subclass of: Restriction
  min cardinality: 0
  on property: language mdLang
subclass of: Restriction
  min cardinality: 0
  on property: characterSet mdChar
subclass of: Restriction
  on property: metadataStandardVersion
  min cardinality: 0
subclass of: Restriction
  on property: metadataStandardName
  min cardinality: 0
subclass of: Restriction
  on property: parentIdentifier
  min cardinality: 0
subclass of: Restriction
  on property: hierarchyLevel
  min cardinality: 0
subclass of: Restriction
  on property: hierarchyLevelName
  min cardinality: 0
subclass of: Restriction
  on property: spatialRepresentationInfo
  min cardinality: 0
subclass of: Restriction
  on property: referenceSystemInfo
  min cardinality: 0
subclass of: Restriction
  on property: metadataExtensionInfo
  min cardinality: 0
subclass of: Restriction
  on property: contentInfo
  min cardinality: 0
subclass of: Restriction
  on property: portrayalCatalogueInfo
  min cardinality: 0
subclass of: Restriction
  on property: dataQualityInfo
  min cardinality: 0
subclass of: Restriction
  on property: distributionInfo
  min cardinality: 0
subclass of: Restriction
  on property: applicationSchemaInfo
  min cardinality: 0
subclass of: Restriction
  on property: metadataMaintenance
  min cardinality: 0
subclass of: Restriction
  on property: identificationInfo
  min cardinality: 1
subclass of: Restriction
  on property: metadataConstraints
  min cardinality: 0
subclass of: Restriction
  on property: filedIdentifier
  max cardinality: 1
subclass of: Restriction
  max cardinality: 1
  on property: language mdLang
subclass of: Restriction
  max cardinality: 1
  on property: characterSet mdChar
subclass of: Restriction
  on property: dateStamp
  cardinality: 1
subclass of: Restriction
  on property: parentIdentifier
  max cardinality: 1
subclass of: Restriction
  on property: contact
  cardinality: 1
subclass of: Restriction
  on property: metadataStandardName
  max cardinality: 1
subclass of: Restriction
  on property: metadataStandardVersion
  max cardinality: 1
subclass of: Restriction
  on property: distributionInfo
  max cardinality: 1
subclass of: Restriction
  on property: metadataMaintenance
  max cardinality: 1

filedIdentifier
type: FunctionalProperty
type: DatatypeProperty
domain: MD Metadata
comment: unique identifier for this metadata file
range: string
short name: mdFileID

language mdLang
type: DatatypeProperty
type: FunctionalProperty
domain: MD Metadata
range: string
comment: language used for documenting metadata
short name: mdLang
condition: not defined by encoding?

characterSet mdChar
type: FunctionalProperty
type: ObjectProperty
default value: utf8
domain: MD Metadata
range: MD CharacterSetCode
comment: full name of the character coding standard used for the metadata set
short name: mdChar
condition: ISO/IEC 10646-1 not used and not defined by encoding

metadataStandardVersion
type: DatatypeProperty
type: FunctionalProperty
range: string
domain: MD Metadata
comment: version (profile) of the metadata standard used
short name: mdStanVer

metadataStandardName
type: DatatypeProperty
type: FunctionalProperty
domain: MD Metadata
range: string
comment: name of the metadata standard (including profile name) used
short name: mdStanName

parentIdentifier
type: DatatypeProperty
type: FunctionalProperty
range: string
domain: MD Metadata
comment: file identifier of the metadata to which this metadata is a subset (child)
short name: mdParentID

hierarchyLevel
type: ObjectProperty
domain: MD Metadata
comment: scope to which the metadata applies (see annex H for more information about metadata hierarchy levels)
range: MD ScopeCode
short name: mdHrLv
condition: hierarchyLevel is not equal to “dataset”?
default value: MD_ScopeCode = "dataset"

hierarchyLevelName
type: DatatypeProperty
range: string
domain: MD Metadata
comment: name of the hierarchy levels for which the metadata is provided
short name: mdHrLvName

spatialRepresentationInfo
type: ObjectProperty
domain: MD Metadata
comment: digital representation of spatial information in the dataset
range: MD SpatialRepresentation
short name: spatRepInfo

referenceSystemInfo
type: ObjectProperty
domain: MD Metadata
comment: description of the spatial and temporal reference systems used in the dataset
range: MD ReferenceSystem
short name: refSysInfo

metadataExtensionInfo
type: ObjectProperty
domain: MD Metadata
comment: information describing metadata extensions
range: MD MetadataExtensionInformation
short name: mdExtInfo

contentInfo
type: ObjectProperty
domain: MD Metadata
comment: provides information about the feature catalogue and describes the coverage and image data characteristics
range: MD ContentInformation
short name: contInfo

portrayalCatalogueInfo
type: ObjectProperty
domain: MD Metadata
range: MD PortrayalCatalogueReference
comment: provides information about the catalogue of rules defined for the portrayal of a resource(s)
short name: porCatInfo

dataQualityInfo
type: ObjectProperty
domain: MD Metadata
comment: provides overall assessment of quality of a resource(s)
range: DQ DataQuality
short name: dqInfo

distributionInfo
type: FunctionalProperty
type: ObjectProperty
domain: MD Metadata
comment: provides information about the distributor of and options for obtaining the resource(s)
range: MD Distribution
short name: distInfo

applicationSchemaInfo
type: ObjectProperty
domain: MD Metadata
comment: provides information about the conceptual schema of a dataset
range: MD ApplicationSchemaInformation
short name: appSchInfo

metadataMaintenance
type: FunctionalProperty
type: ObjectProperty
domain: MD Metadata
comment: provides information about the frequency of metadata updates, and the scope of those updates
range: MD MaintenanceInformation
short name: mdMaint

identificationInfo
type: ObjectProperty
domain: MD Metadata
comment: basic information about the resource(s) to which the metadata applies
range: MD Identification
short name: dataIdInfo

metadataConstraints
type: ObjectProperty
domain: MD Metadata
comment: provides restrictions on the access and use of data
range: MD Constraints
short name: mdConst

dateStamp
type: ObjectProperty
type: FunctionalProperty
domain: MD Metadata
comment: date that the metadata was created
range: Date
short name: mdDateSt

contact
type: ObjectProperty
type: FunctionalProperty
domain: MD Metadata
comment: party responsible for the metadata information
range: CI ResponsibleParty
short name: mdContact

CI OnLineFunctionCode
type: Class
stereotypes: codelist
domain code: OnFunctCd
comment: function performed by the resource
equivalent class: Class
  one of: download
  one of: information
  one of: offLineAccess
  one of: order
  one of: search

download
type: CI OnLineFunctionCode
domain code: 001
comment: online instructions for transferring data from one storage device or system to another

information
type: CI OnLineFunctionCode
domain code: 002
comment: online information about the resource

offLineAccess
type: CI OnLineFunctionCode
domain code: 003
comment: online instructions for requesting the resource from the provider

order
type: CI OnLineFunctionCode
domain code: 004
comment: online order process for obtaining the resource

search
type: CI OnLineFunctionCode
domain code: 005
comment: online search interface for seeking out information about the resource

MD Constraints
type: Class
stereotypes: class
subclass of: Restriction
  on property: useLimitation
  min cardinality: 0
comment: restrictions on the access and use of a resource or metadata
short name: Consts

useLimitation
type: DatatypeProperty
range: string
domain: MD Constraints
comment: limitation affecting the fitness for use of the resource. Example, “not to be used for navigation”
short name: useLimit

MD StandardOrderProcess
type: Class
stereotypes: class
subclass of: Restriction
  on property: fees
  min cardinality: 0
subclass of: Restriction
  on property: fees
  max cardinality: 1
subclass of: Restriction
  on property: plannedAvailableDateTime
  min cardinality: 0
subclass of: Restriction
  on property: plannedAvailableDateTime
  max cardinality: 1
subclass of: Restriction
  on property: orderingInstructions
  min cardinality: 0
subclass of: Restriction
  on property: orderingInstructions
  max cardinality: 1
subclass of: Restriction
  on property: tumaround
  min cardinality: 0
subclass of: Restriction
  on property: tumaround
  max cardinality: 1
comment: common ways in which the resource may be obtained or received, and related instructions and fee information
short name: StanOrdProc

fees
type: DatatypeProperty
type: FunctionalProperty
range: string
domain: MD StandardOrderProcess
comment: fees and terms for retrieving the resource. Include monetary units (as specified in ISO 4217)
short name: resFees

plannedAvailableDateTime
type: ObjectProperty
type: FunctionalProperty
domain: MD StandardOrderProcess
range: DateTime
comment: date and time when the dataset will be available
short name: planAvDtTm

orderingInstructions
type: DatatypeProperty
type: FunctionalProperty
range: string
domain: MD StandardOrderProcess
comment: general instructions, terms and services provided by the distributor
short name: ordInstr

tumaround
type: DatatypeProperty
type: FunctionalProperty
range: string
domain: MD StandardOrderProcess
comment: typical turnaround time for the filling of an order
short name: ordTurn

MD ProjectionParameters
type: Class
stereotypes: class
subclass of: Restriction
  on property: zone
  min cardinality: 0
subclass of: Restriction
  on property: standardParallel
  min cardinality: 0
subclass of: Restriction
  on property: longitudeOfCentralMeridian
  min cardinality: 0
subclass of: Restriction
  on property: longitudeOfProjectionCenter
  min cardinality: 0
subclass of: Restriction
  on property: latitudeOfProjectionOrigin
  min cardinality: 0
subclass of: Restriction
  on property: falseEasting
  min cardinality: 0
subclass of: Restriction
  on property: falseNorthing
  min cardinality: 0
subclass of: Restriction
  on property: falseEastingNorthingUnits
  min cardinality: 0
subclass of: Restriction
  on property: scaleFactorAtEquator
  min cardinality: 0
subclass of: Restriction
  on property: heightOfProspectivePointAboveSurface
  min cardinality: 0
subclass of: Restriction
  on property: latitudeOfProjectionCenter
  min cardinality: 0
subclass of: Restriction
  on property: scaleFactorAtCenterLine
  min cardinality: 0
subclass of: Restriction
  on property: straightVerticalLongitudeFromPole
  min cardinality: 0
subclass of: Restriction
  on property: scaleFactorAtProjectionOrigin
  min cardinality: 0
subclass of: Restriction
  on property: zone
  max cardinality: 1
subclass of: Restriction
  on property: standardParallel
  max cardinality: 1
subclass of: Restriction
  on property: longitudeOfCentralMeridian
  max cardinality: 1
subclass of: Restriction
  on property: latitudeOfProjectionOrigin
  max cardinality: 1
subclass of: Restriction
  on property: falseEasting
  max cardinality: 1
subclass of: Restriction
  on property: falseNorthing
  max cardinality: 1
subclass of: Restriction
  on property: falseEastingNorthingUnits
  max cardinality: 1
subclass of: Restriction
  on property: scaleFactorAtEquator
  max cardinality: 1
subclass of: Restriction
  on property: heightOfProspectivePointAboveSurface
  max cardinality: 1
subclass of: Restriction
  on property: longitudeOfProjectionCenter
  max cardinality: 1
subclass of: Restriction
  on property: scaleFactorAtCenterLine
  max cardinality: 1
subclass of: Restriction
  on property: straightVerticalLongitudeFromPole
  max cardinality: 1
subclass of: Restriction
  on property: scaleFactorAtProjectionOrigin
  max cardinality: 1
subclass of: Restriction
  on property: obliqueLineAzimuthParameter
  min cardinality: 0
subclass of: Restriction
  on property: obliqueLineAzimuthParameter
  max cardinality: 1
subclass of: Restriction
  on property: obliqueLinePointParameter
  min cardinality: 0
subclass of: Restriction
  on property: obliqueLinePointParameter
  max cardinality: 2
comment: set of parameters that describe the projection
short name: ProjParas

zone
type: DatatypeProperty
type: FunctionalProperty
domain: MD ProjectionParameters
range: int
comment: unique identifier for 100,000 metre grid zone
short name: zone

standardParallel
type: DatatypeProperty
domain: MD ProjectionParameters
range: float
comment: line of constant latitude at which the surface of the Earth and the plane or developable surface intersect
short name: stanParal

longitudeOfCentralMeridian
type: DatatypeProperty
type: FunctionalProperty
domain: MD ProjectionParameters
range: float
comment: line of longitude at the centre of a map projection generally used as the basis for constructing the projection
short name: longCntMer

longitudeOfProjectionCenter
type: DatatypeProperty
type: FunctionalProperty
domain: MD ProjectionParameters
range: float
comment: longitude of the point of projection for azimuthal projections
short name: longProjCnt

latitudeOfProjectionOrigin
type: DatatypeProperty
type: FunctionalProperty
domain: MD ProjectionParameters
range: float
comment: latitude chosen as the origin of rectangular coordinates for a map projection
short name: latProjOri

falseEasting
type: DatatypeProperty
type: FunctionalProperty
domain: MD ProjectionParameters
range: float
comment: value added to all “x” values in the rectangular coordinates for a map projection. This value frequently is assigned to eliminate negative numbers. Expressed in the unit of measure identified in Planar Coordinate Units
short name: falEastng

falseNorthing
type: DatatypeProperty
type: FunctionalProperty
domain: MD ProjectionParameters
range: float
comment: value added to all “y” values in the rectangular coordinates for a map projection. This value frequently is assigned to eliminate negative numbers. Expressed in the unit of measure identified in Planar Coordinate Units
short name: falNorthng

falseEastingNorthingUnits
type: ObjectProperty
type: FunctionalProperty
domain: MD ProjectionParameters
range: UomLength
comment: units of false northing and false easting
short name: falENUnits

scaleFactorAtEquator
type: DatatypeProperty
type: FunctionalProperty
domain: MD ProjectionParameters
range: float
comment: ratio between physical distance and corresponding map distance, along the equator
short name: sclFacEqu

heightOfProspectivePointAboveSurface
type: DatatypeProperty
type: FunctionalProperty
domain: MD ProjectionParameters
range: float
comment: height of viewpoint above the Earth, expressed in metres
short name: hgtProsPt

latitudeOfProjectionCenter
type: DatatypeProperty
type: FunctionalProperty
domain: MD ProjectionParameters
range: float
comment: latitude of the point of projection for azimuthal projections
short name: latProjCnt

scaleFactorAtCenterLine
type: DatatypeProperty
type: FunctionalProperty
domain: MD ProjectionParameters
range: float
comment: ratio between physical distance and corresponding map distance, along the centre line
short name: sclFacCnt

straightVerticalLongitudeFromPole
type: DatatypeProperty
type: FunctionalProperty
domain: MD ProjectionParameters
range: float
comment: longitude to be oriented straight up from the North or South Pole
short name: stVrLongPl

scaleFactorAtProjectionOrigin
type: DatatypeProperty
type: FunctionalProperty
domain: MD ProjectionParameters
range: float
comment: multiplier for reducing a distance obtained from a map by computation or scaling tot he actual distance at the projection origin
short name: sclFacPrOr

obliqueLineAzimuthParameter
type: ObjectProperty
type: FunctionalProperty
domain: MD ProjectionParameters
range: MD ObliqueLineAzimuth
comment: parameters describing the oblique line azimuth
short name: obLnAziPars

obliqueLinePointParameter
type: ObjectProperty
domain: MD ProjectionParameters
range: MD ObliqueLinePoint
comment: parameters describing the oblique line point
short name: obLnPtPars

MD Band
type: Class
stereotypes: class
subclass of: MD RangeDimension
subclass of: Restriction
  on property: maxValue
  min cardinality: 0
subclass of: Restriction
  on property: maxValue
  max cardinality: 1
subclass of: Restriction
  on property: minValue
  min cardinality: 0
subclass of: Restriction
  on property: minValue
  max cardinality: 1
subclass of: Restriction
  on property: units
  min cardinality: 0
subclass of: Restriction
  on property: units
  max cardinality: 1
subclass of: Restriction
  on property: peakResponse
  min cardinality: 0
subclass of: Restriction
  on property: peakResponse
  max cardinality: 1
subclass of: Restriction
  on property: bitsPerValue
  min cardinality: 0
subclass of: Restriction
  on property: bitsPerValue
  max cardinality: 1
subclass of: Restriction
  on property: toneGradation
  min cardinality: 0
subclass of: Restriction
  on property: toneGradation
  max cardinality: 1
subclass of: Restriction
  on property: scaleFactor
  min cardinality: 0
subclass of: Restriction
  on property: scaleFactor
  max cardinality: 1
subclass of: Restriction
  on property: offset
  min cardinality: 0
subclass of: Restriction
  on property: offset
  max cardinality: 1
comment: range of wavelengths in the electromagnetic spectrum
short name: Band

MD RangeDimension
type: Class
stereotypes: class
subclass of: Restriction
  on property: descriptor
  min cardinality: 0
subclass of: Restriction
  on property: descriptor
  max cardinality: 1
subclass of: Restriction
  on property: sequenceIdentifier
  min cardinality: 0
subclass of: Restriction
  on property: sequenceIdentifier
  max cardinality: 1
comment: information on the range of each dimension of a cell measurement value
short name: RangeDim

maxValue
type: DatatypeProperty
type: FunctionalProperty
domain: MD Band
range: float
comment: longest wavelength that the sensor is capable of collecting within a designated band
short name: maxVal

minValue
type: DatatypeProperty
type: FunctionalProperty
domain: MD Band
range: float
comment: shortest wavelength that the sensor is capable of collecting within a designated band
short name: minVal

units
type: ObjectProperty
type: FunctionalProperty
domain: MD Band
comment: units in which sensor wavelengths are expressed
range: UomLength
short name: valUnit
condition: minValue or maxValue provided?

peakResponse
type: DatatypeProperty
type: FunctionalProperty
domain: MD Band
range: float
comment: wavelength at which the response is the highest
short name: pkResp

bitsPerValue
type: DatatypeProperty
type: FunctionalProperty
domain: MD Band
comment: maximum number of significant bits in the uncompressed representation for the value in each band of each pixel
range: float
short name: bitsPerVal

toneGradation
type: DatatypeProperty
type: FunctionalProperty
domain: MD Band
comment: number of discrete numerical values in the grid data
short name: toneGrad
range: int

scaleFactor
type: DatatypeProperty
type: FunctionalProperty
domain: MD Band
range: float
comment: scale factor which has been applied to the cell value
short name: sclFac

offset
type: DatatypeProperty
type: FunctionalProperty
domain: MD Band
range: float
comment: the physical value corresponding to a cell value of zero
short name: offset

DQ CompletenessCommission
type: Class
stereotypes: class
subclass of: DQ Completeness
comment: excess data present in the dataset, as described by the scope
short name: DQCompComm

MD SpatialRepresentation
type: Class
stereotypes: abstractClass
comment: method used to represent geographic information in the dataset

TM Primitive
type: Class
stereotypes: class

MD FeatureTypeList
type: Class
stereotypes: class
subclass of: Restriction
  on property: spatialObject
  cardinality: 1
subclass of: Restriction
  on property: spatialSchemaName
  cardinality: 1
comment: list of names of feature types with the same spatial representation (same as spatial attributes)
short name: FeatTypList

spatialObject
type: DatatypeProperty
type: FunctionalProperty
range: string
domain: MD FeatureTypeList
comment: instance of a type defined in the spatial schema
short name: spatObj

spatialSchemaName
type: DatatypeProperty
type: FunctionalProperty
range: string
domain: MD FeatureTypeList
comment: name of the spatial schema used
short name: spatSchName

CI RoleCode
type: Class
stereotypes: codelist
domain code: RoleCd
comment: function performed by the responsible party
equivalent class: Class
  one of: resourceProvider
  one of: custodian
  one of: owner
  one of: user
  one of: distributor RoleCd
  one of: originator
  one of: pointOfContact
  one of: principalInvestigator
  one of: processor RoleCd
  one of: publisher

resourceProvider
type: CI RoleCode
domain code: 001
comment: party that supplies the resource

custodian
type: CI RoleCode
domain code: 002
comment: party that accepts accountability and responsibility for the data and ensures appropriate care and maintenance of the resource

owner
type: CI RoleCode
domain code: 003
comment: party that owns the resource

user
type: CI RoleCode
domain code: 003
comment: party who uses the resource

distributor RoleCd
type: CI RoleCode
domain code: 005
comment: party who distributes the resource

originator
type: CI RoleCode
domain code: 006
comment: party who created the resource

pointOfContact
type: CI RoleCode
domain code: 007
comment: party who can be contacted for acquiring knowledge about or acquisition of the resource

principalInvestigator
type: CI RoleCode
domain code: 008
comment: key party responsible for gathering information and conducting research

processor RoleCd
type: CI RoleCode
domain code: 009
comment: party who has processed the data in a manner such that the resource has been modified

publisher
type: CI RoleCode
domain code: 010
comment: party who published the resource

MD ScopeCode
type: Class
stereotypes: codelist
comment: class of information to which the referencing entity applies
equivalent class: Class
  one of: attribute
  one of: attributeType
  one of: collectionHardware
  one of: collectionSession
  one of: dataset ScopeCd
  one of: series
  one of: nonGeographicDataset
  one of: dimensionGroup
  one of: feature
  one of: featureType
  one of: propertyType
  one of: fieldSesson
  one of: software
  one of: service
  one of: model

attribute
type: MD ScopeCode
domain code: 001
comment: information applies to the attribute class

attributeType
type: MD ScopeCode
domain code: 002
comment: information applies to the characteristic of a feature

collectionHardware
type: MD ScopeCode
domain code: 003
comment: information applies to the collection hardware class

collectionSession
type: MD ScopeCode
domain code: 004
comment: information applies to the collection session

dataset ScopeCd
type: MD ScopeCode
domain code: 005
comment: information applies to the dataset

series
type: MD ScopeCode
domain code: 005
comment: information applies to the series

nonGeographicDataset
type: MD ScopeCode
domain code: 007
comment: information applies to non-geographic data

dimensionGroup
type: MD ScopeCode
domain code: 008
comment: information applies to a dimension group

feature
type: MD ScopeCode
domain code: 009
comment: information applies to a feature

featureType
type: MD ScopeCode
domain code: 010
comment: information applies to a feature type

propertyType
type: MD ScopeCode
domain code: 011
comment: information applies to a property type

fieldSesson
type: MD ScopeCode
domain code: 012
comment: information applies to a field session

software
type: MD ScopeCode
domain code: 013
comment: information applies to a computer program or routine

service
type: MD ScopeCode
domain code: 014
comment: information applies to a capability which a service provider entity makes available to a service user entity through a set of interfaces that define a behaviour, such as a use case

model
type: MD ScopeCode
domain code: 015
comment: information applies to a copy or imitation of an existing or hypothetical object

CI Date
type: Class
stereotypes: class
subclass of: Restriction
  on property: dateType
  cardinality: 1
subclass of: Restriction
  cardinality: 1
  on property: date refDate
comment: reference date and event used to describe it
short name: DateRef

dateType
type: ObjectProperty
type: FunctionalProperty
domain: CI Date
range: CI DateTypeCode
comment: event used for reference date
short name: refDateType

date refDate
type: FunctionalProperty
type: ObjectProperty
domain: CI Date
range: Date
comment: reference date for the cited resource
short name: refDate

DQ TemporalConsistency
type: Class
stereotypes: class
subclass of: DQ TemporalAccuracy
comment: correctness of ordered events or sequences, if reported
short name: DQTempConsis

Scale
type: Class
stereotypes: class

MD ServiceIdentification
type: Class
stereotypes: class
subclass of: MD Identification
comment: identification of capabilities which a service provider makes available to a service user through a set of interfaces that define a behaviour - See ISO 19119 – Services for further information
short name: SerIdent

MD PixelOrientationCode
type: Class
stereotypes: enumeration
comment: point in a pixel corresponding to the Earth location of the pixel
equivalent class: Class
  one of: center
  one of: lowerLeft
  one of: lowerRight
  one of: upperRight
  one of: upperLeft
stereotypes: codelist
domain code: PixOrientCd

center
type: MD PixelOrientationCode
domain code: 001
comment: point halfway between the lower left and the upper right of the pixel

lowerLeft
type: MD PixelOrientationCode
domain code: 002
comment: the corner in the pixel closest to the origin of the SRS; if two are at the same distance from the origin, the one with the smallest x-value

lowerRight
type: MD PixelOrientationCode
domain code: 003
comment: next corner counterclockwise from the lower left

upperRight
type: MD PixelOrientationCode
domain code: 004
comment: next corner counterclockwise from the lower right

upperLeft
type: MD PixelOrientationCode
domain code: 005
comment: next corner counterclockwise from the upper right

DQ NonQuantitativeAttributeAccuracy
type: Class
stereotypes: class
subclass of: DQ ThematicAccuracy
comment: correctness of non-quantitative attributes
short name: DQNonQuanAttAcc

extentTypeCode
type: DatatypeProperty
type: FunctionalProperty
default value: 1
domain: EX GeographicExtent
range: boolean
comment: indication of whether the bounding polygon encompasses an area covered by the data or an area where data is not present
short name: exTypeCode

DQ QuantitativeAttributeAccuracy
type: Class
stereotypes: class
subclass of: DQ ThematicAccuracy
comment: accuracy of quantitative attributes
short name: DQQuanAttAcc

MD CoverageContentTypeCode
type: Class
stereotypes: codelist
domain code: ContentTypCd
comment: specific type of information represented in the cell
equivalent class: Class
  one of: image
  one of: thematicClassification
  one of: physicalMeasurement

image
type: MD CoverageContentTypeCode
domain code: 001
comment: meaningful numerical representation of a physical parameter that is not the actual value of the physical parameter

thematicClassification
type: MD CoverageContentTypeCode
domain code: 002
comment: code value with no quantitative meaning, used to represent a physical quantity

physicalMeasurement
type: MD CoverageContentTypeCode
domain code: 003
comment: value in physical units of the quantity being measured

result
type: ObjectProperty
domain: DQ Element
range: DQ Result
comment: value (or set of values) obtained from applying a data quality measure or the out come of evaluating the obtained value (or set of values) against a specified acceptable conformance quality level
short name: measResult

dateTime measDateTm
type: ObjectProperty
type: FunctionalProperty
domain: DQ Element
range: DateTime
comment: date or range of dates on which a data quality measure was applied
short name: measDateTm

evaluationProcedure
type: FunctionalProperty
type: ObjectProperty
domain: DQ Element
range: CI Citation
comment: reference to the procedure information
short name: evalProc

evaluationMethodType
type: ObjectProperty
type: FunctionalProperty
domain: DQ Element
range: DQ EvaluationMethodTypeCode
comment: type of method used to evaluate quality of the dataset
short name: evalMethType

evaluationMethodDescription
type: DatatypeProperty
type: FunctionalProperty
range: string
domain: DQ Element
comment: description of the evaluation method
short name: evalMethDesc

measureIdentification
type: ObjectProperty
type: FunctionalProperty
domain: DQ Element
range: MD Identifier
comment: code identifying a registered standard procedure
short name: measId

measureDescription
type: DatatypeProperty
type: FunctionalProperty
range: string
domain: DQ Element
comment: description of the measure being determined
short name: measDesc

nameOfMeasure
type: DatatypeProperty
range: string
domain: DQ Element
comment: name of the test applied to the data
short name: measName

CI Contact
type: Class
stereotypes: datatypeClass
subclass of: Restriction
  on property: phone
  min cardinality: 0
subclass of: Restriction
  on property: address
  min cardinality: 0
subclass of: Restriction
  on property: hoursOfService
  min cardinality: 0
subclass of: Restriction
  on property: onlineResource
  min cardinality: 0
subclass of: Restriction
  on property: contactInstructions
  min cardinality: 0
subclass of: Restriction
  on property: phone
  max cardinality: 1
subclass of: Restriction
  on property: address
  max cardinality: 1
subclass of: Restriction
  on property: onlineResource
  max cardinality: 1
subclass of: Restriction
  on property: hoursOfService
  max cardinality: 1
subclass of: Restriction
  on property: contactInstructions
  max cardinality: 1
comment: information required to enable contact with the responsible person and/or organization
short name: Contact

phone
type: ObjectProperty
type: FunctionalProperty
domain: CI Contact
range: CI Telephone
comment: telephone numbers at which the organization or individual may be contacted
short name: cntPhone

address
type: ObjectProperty
type: FunctionalProperty
domain: CI Contact
range: CI Address
comment: physical and email address at which the organization or individual may be contacted
short name: cntAddress

hoursOfService
type: DatatypeProperty
type: FunctionalProperty
range: string
domain: CI Contact
comment: time period (including time zone) when individuals can contact the organization or individual
short name: cntHours

onlineResource
type: ObjectProperty
type: FunctionalProperty
domain: CI Contact
range: CI OnlineResource
comment: on-line information that can be used to contact the individual or organization
short name: cntOnlineRes

contactInstructions
type: DatatypeProperty
type: FunctionalProperty
range: string
domain: CI Contact
comment: supplemental instructions on how or when to contact the individual or organization
short name: cntInstr

DQ GriddedDataPositionalAccuracy
type: Class
stereotypes: class
subclass of: DQ PositionAccuracy
comment: closeness of gridded data position values to values accepted as or being true
short name: DQGridDataPosAcc

DQ ConformanceResult
type: Class
stereotypes: class
subclass of: DQ Result
subclass of: Restriction
  cardinality: 1
  on property: specification conSpec
subclass of: Restriction
  on property: explanation
  cardinality: 1
subclass of: Restriction
  on property: pass
  cardinality: 1
comment: Information about the outcome of evaluating the obtained value (or set of values) against a specified acceptable conformance quality level
short name: ConResult

specification conSpec
type: ObjectProperty
type: FunctionalProperty
domain: DQ ConformanceResult
range: CI Citation
comment: citation of product specification or user requirement against which data is being evaluated
short name: conSpec

explanation
type: DatatypeProperty
type: FunctionalProperty
range: string
domain: DQ ConformanceResult
comment: explanation of the meaning of conformance for this result
short name: conExpl

pass
type: DatatypeProperty
type: FunctionalProperty
domain: DQ ConformanceResult
range: boolean
comment: indication of the conformance result where 0 = fail and 1 = pass
short name: conPass

GenericName
type: Class
stereotypes: class

MD EllipsoidParameters
type: Class
stereotypes: class
subclass of: Restriction
  on property: semiMajorAxis
  cardinality: 1
subclass of: Restriction
  on property: axisUnits
  cardinality: 1
subclass of: Restriction
  on property: denominationOfFlatteningRatio
  min cardinality: 0
subclass of: Restriction
  on property: denominationOfFlatteningRatio
  max cardinality: 1
comment: set of parameters that describe the ellipsoid
short name: EllParas

semiMajorAxis
type: DatatypeProperty
type: FunctionalProperty
domain: MD EllipsoidParameters
range: float
comment: radius of the equatorial axis of the ellipsoid
short name: semiMajAx

axisUnits
type: ObjectProperty
type: FunctionalProperty
domain: MD EllipsoidParameters
range: UomLength
comment: units of the semi-major axis
short name: axisUnits

denominationOfFlatteningRatio
type: DatatypeProperty
type: FunctionalProperty
domain: MD EllipsoidParameters
range: float
condition: not a spheroid ?
comment: ratio of the difference between the equatorial and polar radii of the ellipsoid to the equatorial radius when the numerator is set to 1
short name: denFlatRat

LI ProcessStep
type: Class
stereotypes: class
subclass of: Restriction
  min cardinality: 0
  on property: rationale stepRat
subclass of: Restriction
  min cardinality: 0
  on property: dateTime stepDateTm
subclass of: Restriction
  min cardinality: 0
  on property: source stepSrc
subclass of: Restriction
  cardinality: 1
  on property: description stepDesc
subclass of: Restriction
  max cardinality: 1
  on property: rationale stepRat
subclass of: Restriction
  max cardinality: 1
  on property: dateTime stepDateTm
subclass of: Restriction
  on property: processor
  min cardinality: 0
comment: information about an event in the creation process for the data specified by the scope
short name: PrcessStep

rationale stepRat
type: DatatypeProperty
range: string
domain: LI ProcessStep
comment: requirement or purpose for the process step
short name: stepRat

dateTime stepDateTm
type: FunctionalProperty
type: ObjectProperty
domain: LI ProcessStep
range: DateTime
comment: date and time or range of date and time on or over which the process step occurred
short name: stepDateTm

source stepSrc
type: ObjectProperty
domain: LI ProcessStep
range: LI Source
comment: information about the source data used in creating the data specified by the scope
short name: stepSrc

description stepDesc
type: DatatypeProperty
type: FunctionalProperty
range: string
domain: LI ProcessStep
comment: description of the event, including related parameters or tolerances
short name: stepDesc

processor
type: ObjectProperty
domain: LI ProcessStep
comment: identification of, and means of communication with, person(s) and organization(s) associated with the process step
range: CI ResponsibleParty
short name: stepProc

MD Keywords
type: Class
stereotypes: class
subclass of: Restriction
  on property: keyword
  min cardinality: 1
subclass of: Restriction
  on property: thesaurusName
  min cardinality: 0
subclass of: Restriction
  on property: type
  min cardinality: 0
subclass of: Restriction
  on property: thesaurusName
  max cardinality: 1
subclass of: Restriction
  on property: type
  max cardinality: 1
short name: Keywords
comment: keywords, their type and reference source

keyword
type: DatatypeProperty
range: string
domain: MD Keywords
comment: commonly used word(s) or formalised word(s) or phrase(s) used to describe the subject
short name: keyword

thesaurusName
type: FunctionalProperty
type: ObjectProperty
domain: MD Keywords
range: CI Citation
comment: name of the formally registered thesaurus or a similar authoritative source of keywords
short name: thesaName

type
type: FunctionalProperty
type: ObjectProperty
domain: MD Keywords
range: MD KeywordTypeCode
comment: subject matter used to group similar keywords
short name: keyTyp

Angle
type: Class
stereotypes: class

MD Format
type: Class
stereotypes: class
subclass of: Restriction
  cardinality: 1
  on property: name formatName
subclass of: Restriction
  on property: version
  cardinality: 1
subclass of: Restriction
  on property: amendmentNumber
  min cardinality: 0
subclass of: Restriction
  on property: amendmentNumber
  max cardinality: 1
subclass of: Restriction
  min cardinality: 0
  on property: specification formatSpec
subclass of: Restriction
  max cardinality: 1
  on property: specification formatSpec
subclass of: Restriction
  on property: fileDecompressionTechnique
  min cardinality: 0
subclass of: Restriction
  on property: fileDecompressionTechnique
  max cardinality: 1
subclass of: Restriction
  on property: formatDistributor
  min cardinality: 0
comment: description of the computer language construct that specifies the representation of data objects in a record, file, message, storage device or transmission channel
short name: Format

name formatName
type: DatatypeProperty
type: FunctionalProperty
range: string
domain: MD Format
comment: name of the data transfer format(s)
short name: formatName

version
type: DatatypeProperty
type: FunctionalProperty
range: string
domain: MD Format
comment: version of the format (date, number, etc.)
short name: formatVer

amendmentNumber
type: DatatypeProperty
type: FunctionalProperty
range: string
domain: MD Format
comment: amendment number of the format version
short name: formatAmdNum

specification formatSpec
type: DatatypeProperty
type: FunctionalProperty
range: string
domain: MD Format
comment: name of a subset, profile, or product specification of the format
short name: formatSpec

fileDecompressionTechnique
type: DatatypeProperty
type: FunctionalProperty
range: string
domain: MD Format
comment: recommendations of algorithms or processes that can be applied to read or expand resources to which compression techniques have been applied
short name: fileDecmTech

formatDistributor
type: ObjectProperty
domain: MD Format
range: MD Distributor
comment: provides information about the distributor’s format
short name: formatDist

SC VerticalDatum
type: Class
stereotypes: class

DQ RelativeIntermalPositionAccuracy
type: Class
stereotypes: class
subclass of: DQ PositionAccuracy
comment: closeness of the relative positions of features in the scope to their respective relative positions accepted as or being true
short name: DQRelIntPosAcc

RS Identifier
type: Class
stereotypes: class
subclass of: MD Identifier
comment: identifier used for reference systems
short name: RsIdent

MD Identifier
type: Class
stereotypes: datatypeClass
subclass of: Restriction
  on property: code
  cardinality: 1
subclass of: Restriction
  on property: authority
  min cardinality: 0
subclass of: Restriction
  on property: authority
  max cardinality: 1
comment: value uniquely identifying an object within a namespace
short name: MdIdent

MD SecurityConstraints
type: Class
stereotypes: class
subclass of: MD Constraints
subclass of: Restriction
  on property: handlingDescription
  min cardinality: 0
subclass of: Restriction
  on property: classificationSystem
  min cardinality: 0
subclass of: Restriction
  on property: userNote
  min cardinality: 0
subclass of: Restriction
  on property: classification
  cardinality: 1
subclass of: Restriction
  on property: userNote
  max cardinality: 1
subclass of: Restriction
  on property: classificationSystem
  max cardinality: 1
subclass of: Restriction
  on property: handlingDescription
  max cardinality: 1
comment: handling restrictions imposed on the resource for national security or similar security concerns
short name: SecConsts

handlingDescription
type: DatatypeProperty
type: FunctionalProperty
range: string
domain: MD SecurityConstraints
comment: additional information about the restrictions on handling the resource
short name: handDesc

classificationSystem
type: DatatypeProperty
type: FunctionalProperty
short name: classSys
range: string
domain: MD SecurityConstraints
comment: name of the classification system

userNote
type: DatatypeProperty
type: FunctionalProperty
range: string
domain: MD SecurityConstraints
comment: explanation of the application of the legal constraints or other restrictions and legal prerequisites for obtaining and using the resource
short name: userNote

classification
type: ObjectProperty
type: FunctionalProperty
short name: class
domain: MD SecurityConstraints
comment: name of the handling restrictions on the resource
range: MD ClassificationCode

code
type: DatatypeProperty
type: FunctionalProperty
range: string
domain: MD Identifier
comment: alphanumeric value identifying an instance in the namespace
short name: identCode

authority
type: ObjectProperty
type: FunctionalProperty
domain: MD Identifier
range: CI Citation
comment: person or party responsible for maintenance of the namespace
short name: identAuth

CI Address
type: Class
stereotypes: datatypeClass
subclass of: Restriction
  on property: city
  min cardinality: 0
subclass of: Restriction
  on property: deliveryPoint
  min cardinality: 0
subclass of: Restriction
  on property: administrativeArea
  min cardinality: 0
subclass of: Restriction
  on property: postalCode
  min cardinality: 0
subclass of: Restriction
  on property: country
  min cardinality: 0
subclass of: Restriction
  on property: electiveMailAddress
  min cardinality: 0
subclass of: Restriction
  on property: city
  max cardinality: 1
subclass of: Restriction
  on property: administrativeArea
  max cardinality: 1
subclass of: Restriction
  on property: postalCode
  max cardinality: 1
subclass of: Restriction
  on property: country
  max cardinality: 1
comment: location of the responsible individual or organization
short name: Address

city
type: DatatypeProperty
type: FunctionalProperty
range: string
domain: CI Address
comment: city of the location
short name: city

deliveryPoint
type: DatatypeProperty
range: string
domain: CI Address
comment: address line for the location (as described in ISO 11180, annex A)
short name: delPoint

administrativeArea
type: DatatypeProperty
type: FunctionalProperty
range: string
domain: CI Address
comment: state, province of the location
short name: adminArea

postalCode
type: DatatypeProperty
type: FunctionalProperty
range: string
domain: CI Address
comment: ZIP or other postal code
short name: postCode

country
type: DatatypeProperty
type: FunctionalProperty
range: string
domain: CI Address
comment: country of the physical address
short name: country

electiveMailAddress
type: DatatypeProperty
range: string
domain: CI Address
comment: address of the electronic mailbox of the responsible organization or individual
short name: eMailAdd

RecordType
type: Class
stereotypes: class

contentType
type: ObjectProperty
type: FunctionalProperty
domain: MD CoverageDescription
range: MD CoverageContentTypeCode
comment: type of information represented by the cell value
short name: contentTyp

attributeDescription
type: ObjectProperty
type: FunctionalProperty
domain: MD CoverageDescription
comment: description of the attribute described by the measurement value
short name: attDesc
range: RecordType

dimension
type: ObjectProperty
domain: MD CoverageDescription
range: MD RangeDimension
comment: information on the dimensions of the cell measurement value
short name: covDim

MD Distribution
type: Class
stereotypes: class
subclass of: Restriction
  on property: distributor
  min cardinality: 0
subclass of: Restriction
  on property: transferOptions
  min cardinality: 0
subclass of: Restriction
  on property: distributionFormat
  min cardinality: 0
comment: information about the distributor of and options for obtaining the resource
short name: Distrib

distributor
type: ObjectProperty
domain: MD Distribution
comment: provides information about the distributor
range: MD Distributor
short name: distributor

transferOptions
type: ObjectProperty
domain: MD Distribution
comment: provides information about technical means and media by which a resource is obtained from the distributor
range: MD DigitalTransferOptions
short name: distTranOps

distributionFormat
type: ObjectProperty
domain: MD Distribution
comment: provides a description of the format of the data to be distributed
range: MD Format
short name: distFormat
condition: MD_Distributor.distibutorF ormat not documented?

LI Source
type: Class
stereotypes: class
subclass of: Restriction
  min cardinality: 0
  on property: description srcDesc
subclass of: Restriction
  on property: scaleDenominator
  min cardinality: 0
subclass of: Restriction
  on property: sourceReferenceSystem
  min cardinality: 0
subclass of: Restriction
  on property: sourceCitation
  min cardinality: 0
subclass of: Restriction
  on property: sourceExtent
  min cardinality: 0
subclass of: Restriction
  on property: sourceStep
  min cardinality: 0
subclass of: Restriction
  max cardinality: 1
  on property: description srcDesc
subclass of: Restriction
  on property: scaleDenominator
  max cardinality: 1
subclass of: Restriction
  on property: sourceCitation
  max cardinality: 1
subclass of: Restriction
  on property: sourceReferenceSystem
  max cardinality: 1
comment: information about the source data used in creating the data specified by the scope
short name: Source

description srcDesc
type: DatatypeProperty
type: FunctionalProperty
range: string
domain: LI Source
comment: detailed description of the level of the source data
short name: srcDesc
condition: sourceExtent not provided?

scaleDenominator
type: ObjectProperty
type: FunctionalProperty
comment: denominator of the representative fraction on a source map
domain: LI Source
range: MD RepresentativeFraction
short name: srcScale

sourceReferenceSystem
type: ObjectProperty
type: FunctionalProperty
comment: spatial reference system used by the source data
domain: LI Source
range: MD ReferenceSystem
short name: srcRefSys

sourceCitation
type: FunctionalProperty
type: ObjectProperty
comment: recommended reference to be used for the source data
domain: LI Source
range: CI Citation
short name: srcCitatn

sourceExtent
type: ObjectProperty
comment: information about the spatial, vertical and temporal extent of the source data
domain: LI Source
range: EX Extent
short name: srcExt
condition: description not provided?

sourceStep
type: DatatypeProperty
comment: information about an event in the creation process for the source data
range: string
domain: LI Source
short name: srcStep

TM ReferenceSystem
type: Class
stereotypes: class
subclass of: RS ReferenceSystem
comment: documented in ISO 19108 – Temporal schema
short name: TMRefSys

DQ RelativeIntermalPositionalAccuracy
type: Class
stereotypes: class
subclass of: DQ PositionAccuracy
comment: closeness of the relative positions of features in the scope to their respective relative positions accepted as or being true
short name: DQRelIntPosAcc

MD DataTypeCode
type: Class
stereotypes: codelist
comment: datatype of element or entity
equivalent class: Class
  one of: class
  one of: codelist
  one of: enumeration
  one of: codelistElement
  one of: abstractClass
  one of: aggregatedClass
  one of: specifiedClass
  one of: dataTypeClass
  one of: interfaceClass
  one of: unionClass
  one of: metaClass
  one of: typeClass
  one of: characterString
  one of: integer
  one of: association
domain code: DatatypeCd

class
type: MD DataTypeCode
domain code: 001
comment: descriptor of a set of objects that share the same attributes, operations, methods, relationships, and behavior

codelist
type: MD DataTypeCode
domain code: 002
comment: flexible enumeration useful for expressing a long list of values, can be extended

enumeration
type: MD DataTypeCode
domain code: 003
comment: data type whose instances form a list of named literal values, not extendable

codelistElement
type: MD DataTypeCode
domain code: 004
comment: permissible value for a codelist or enumeration

abstractClass
type: MD DataTypeCode
domain code: 005
comment: class that cannot be directly instantiated

aggregatedClass
type: MD DataTypeCode
domain code: 006
comment: class that is composed of classes it is connected to by an aggregate relationship

specifiedClass
type: MD DataTypeCode
domain code: 007
comment: subclass that may be substituted for its superclass

dataTypeClass
type: MD DataTypeCode
domain code: 008
comment: class with few or no operations whose primary purpose is to hold the abstract state of another class for transmittal, storage, encoding or persistent storage

interfaceClass
type: MD DataTypeCode
domain code: 009
comment: named set of operations that characterize the behavior of an element

unionClass
type: MD DataTypeCode
domain code: 010
comment: class describing a selection of one of the specified types

metaClass
type: MD DataTypeCode
domain code: 011
comment: class whose instances are classes

typeClass
type: MD DataTypeCode
domain code: 012
comment: class used for specification of a domain of instances (objects), together with the operations applicable to the objects. A type may have attributes and associations

characterString
type: MD DataTypeCode
domain code: 013
comment: free text field

integer
type: MD DataTypeCode
domain code: 014
comment: numerical field

association
type: MD DataTypeCode
domain code: 015
comment: semantic relationship between two classes that involves connections among their instances

DS InitiativeTypeCode
type: Class
stereotypes: codelist
short name: InitTypCd
comment: type of aggregation activity in which datasets are related
equivalent class: Class
  one of: campaign
  one of: collection
  one of: exercise
  one of: experiment
  one of: mission
  one of: nonImageSensor
  one of: operation
  one of: platform
  one of: process
  one of: program
  one of: project
  one of: study
  one of: task
  one of: trial

campaign
type: DS InitiativeTypeCode
domain code: 001
comment: series of organized planned actions

collection
type: DS InitiativeTypeCode
domain code: 002
comment: accumulation of datasets assembled for a specific purpose

exercise
type: DS InitiativeTypeCode
domain code: 003
comment: specific performance of a function or group of functions

experiment
type: DS InitiativeTypeCode
domain code: 004
comment: process designed to find if something is effective or valid

mission
type: DS InitiativeTypeCode
domain code: 006
comment: specific operation of a data collection system

nonImageSensor
type: DS InitiativeTypeCode
domain code: 007
comment: device or piece of equipment which detects or records

operation
type: DS InitiativeTypeCode
domain code: 008
comment: action that is part of a series of actions

platform
type: DS InitiativeTypeCode
domain code: 009
comment: vehicle or other support base that holds a sensor

process
type: DS InitiativeTypeCode
domain code: 010
comment: method of doing something involving a number of steps

program
type: DS InitiativeTypeCode
domain code: 011
comment: specific planned activity

project
type: DS InitiativeTypeCode
domain code: 012
comment: organized undertaking, research, or development

study
type: DS InitiativeTypeCode
domain code: 013
comment: examination or investigation

task
type: DS InitiativeTypeCode
domain code: 014
comment: piece of work

trial
type: DS InitiativeTypeCode
domain code: 015
comment: process of testing to discover or demonstrate something

LI Lineage
type: Class
stereotypes: class
subclass of: Restriction
  on property: processStep
  min cardinality: 0
subclass of: Restriction
  on property: statement
  min cardinality: 0
subclass of: Restriction
  on property: statement
  max cardinality: 1
subclass of: Restriction
  min cardinality: 0
  on property: source dataSource
comment: information about the events or source data used in constructing the data specified by the scope or lack of knowledge about lineage
short name: Lineage

processStep
type: ObjectProperty
domain: LI Lineage
comment: information about an event in the creation process for the data specified by the scope
range: LI ProcessStep
short name: prcStep
condition: statement and source not provided?

statement
type: DatatypeProperty
type: FunctionalProperty
range: string
domain: LI Lineage
comment: general explanation of the data producer’s knowledge about the lineage of a dataset
short name: statement
condition: (DQ_DataQuality.scope. DQ_Scope.level = “dataset” or “series”) and source and processStep not provided?

source dataSource
type: ObjectProperty
domain: LI Lineage
range: LI Source
comment: information about the source data used in creating the data specified by the scope
short name: dataSource
condition: statement and processStep not provided?

MD BrowseGraphics
type: Class
stereotypes: class
subclass of: Restriction
  on property: fileDescription
  min cardinality: 0
subclass of: Restriction
  on property: fileType
  min cardinality: 0
subclass of: Restriction
  on property: fileName
  cardinality: 1
subclass of: Restriction
  on property: fileDescription
  max cardinality: 1
subclass of: Restriction
  on property: fileType
  max cardinality: 1
short name: BrowGraph
comment: graphic that provides an illustration of the dataset (should include a legend for the graphic)

fileDescription
type: DatatypeProperty
type: FunctionalProperty
range: string
domain: MD BrowseGraphics
comment: text description of the illustration
short name: bgFileDesc

fileType
type: DatatypeProperty
type: FunctionalProperty
range: string
domain: MD BrowseGraphics
comment: format in which the illustration is encoded Examples: CGM, EPS, GIF, JPEG, PBM, PS, TIFF, XWD
short name: bgFileType

fileName
type: DatatypeProperty
type: FunctionalProperty
range: string
domain: MD BrowseGraphics
comment: name of the file that contains a graphic that provides an illustration of the dataset
short name: bgFileName

URL
type: Class
stereotypes: class

MD ImagingConditionCode
type: Class
domain code: ImgCondCd
stereotypes: ImgCondCd
comment: code which indicates conditions which may affect the image
equivalent class: Class
  one of: blurredImage
  one of: cloud
  one of: degradingObliquity
  one of: fog
  one of: heavySmokeOrDust
  one of: night
  one of: rain
  one of: semiDarkness
  one of: shadow
  one of: terrainMasking

blurredImage
type: MD ImagingConditionCode
domain code: 001
comment: portion of the image is blurred

cloud
type: MD ImagingConditionCode
domain code: 002
comment: portion of the image is partially obscured by cloud cover

degradingObliquity
type: MD ImagingConditionCode
domain code: 003
comment: acute angle between the plane of the ecliptic (the plane of the Earth’s orbit) and the plane of the celestial equator

fog
type: MD ImagingConditionCode
domain code: 004
comment: portion of the image is partially obscured by fog

heavySmokeOrDust
type: MD ImagingConditionCode
domain code: 005
comment: portion of the image is partially obscured by heavy smoke or dust

night
type: MD ImagingConditionCode
domain code: 006
comment: image was taken at night

rain
type: MD ImagingConditionCode
domain code: 007
comment: image was taken during rainfall

semiDarkness
type: MD ImagingConditionCode
domain code: 008
comment: image was taken during semi-dark conditions—twilight conditions

shadow
type: MD ImagingConditionCode
domain code: 009
comment: portion of the image is obscured by shadow

terrainMasking
type: MD ImagingConditionCode
domain code: 011
comment: the absence of collection data of a given point or area caused by the relative location of topographic features which obstruct the collection path between the collector(s) and the subject(s) of interest

DQ QuantitativeResult
type: Class
stereotypes: class
subclass of: DQ Result
subclass of: Restriction
  on property: valueType
  min cardinality: 0
subclass of: Restriction
  on property: valueUnit
  min cardinality: 0
subclass of: Restriction
  on property: errorStatistic
  min cardinality: 0
subclass of: Restriction
  on property: value
  min cardinality: 1
subclass of: Restriction
  on property: errorStatistic
  max cardinality: 1
subclass of: Restriction
  on property: valueUnit
  max cardinality: 1
comment: Information about the value (or set of values) obtained from applying a data quality measure
short name: QuanResult

valueType
type: FunctionalProperty
type: ObjectProperty
domain: DQ QuantitativeResult
comment: value type for reporting a data quality result
range: RecordType
short name: quanValType

valueUnit
type: FunctionalProperty
type: ObjectProperty
domain: DQ QuantitativeResult
comment: value unit for reporting a data quality result
range: Measure
short name: quanValUnit

errorStatistic
type: DatatypeProperty
type: FunctionalProperty
range: string
domain: DQ QuantitativeResult
comment: statistical method used to determine the value
short name: errStat

value
type: ObjectProperty
domain: DQ QuantitativeResult
comment: quantitative value or values, content determined by the evaluation procedure used
range: Record
short name: quanVal

DQ TopologicalConsistency
type: Class
stereotypes: class
subclass of: DQ LogicalConsistency
comment: correctness of the explicitly encoded topological characteristics of the dataset as described by the scope
short name: DQTopConsis

MD TopicCategoryCode
type: Class
stereotypes: codelist
comment: high-level geographic data thematic classification to assist in the grouping and search of available geographic data sets. Can be used to group keywords as well. Listed examples are not exhaustive. NOTE It is understood there are overlaps between general categories and the user is encouraged to select the one most appropriate.
domain code: TopicCatCd
equivalent class: Class
  one of: farming
  one of: biota
  one of: boundaries
  one of: cliomatologyMetereologyAtmosphere
  one of: economy
  one of: elevation
  one of: environment
  one of: geoscientificInformation
  one of: health
  one of: imageryBaseMapsEarthCover
  one of: intelligenceMilitary
  one of: inlandWaters
  one of: location
  one of: oceans
  one of: planningCadastre
  one of: society
  one of: structure
  one of: transportation
  one of: utilitiesCommunication

farming
type: MD TopicCategoryCode
domain code: 001
comment: rearing of animals and/or cultivation of plants Examples: agriculture, irrigation, aquaculture, plantations, herding, pests and diseases affecting crops and livestock

biota
type: MD TopicCategoryCode
domain code: 002
comment: flora and/or fauna in natural environment Examples: wildlife, vegetation, biological sciences, ecology, wilderness, sealife, wetlands, habitat

boundaries
type: MD TopicCategoryCode
domain code: 003
comment: legal land descriptions Examples: political and administrative boundaries

cliomatologyMetereologyAtmosphere
type: MD TopicCategoryCode
domain code: 004
comment: processes and phenomena of the atmosphere Examples: cloud cover, weather, climate, atmospheric conditions, climate change, precipitation

economy
type: MD TopicCategoryCode
domain code: 005
comment: economic activities, conditions and employment Examples: production, labour, revenue, commerce, industry, tourism and ecotourism, forestry, fisheries, commercial or subsistence hunting, exploration and exploitation of resources such as minerals, oil and gas

elevation
type: MD TopicCategoryCode
domain code: 006
comment: height above or below sea level Examples: altitude, bathymetry, digital elevation models, slope, derived products

environment
type: MD TopicCategoryCode
domain code: 007
comment: environmental resources, protection and conservation Examples: environmental pollution, waste storage and treatment, environmental impact assessment, monitoring environmental risk, nature reserves, landscape

geoscientificInformation
type: MD TopicCategoryCode
domain code: 008
comment: information pertaining to earth sciences Examples: geophysical features and processes, geology, minerals, sciences dealing with the composition, structure and origin of the earth’s rocks, risks of earthquakes, volcanic activity, landslides, gravity information, soils, permafrost, hydrogeology, erosion

health
type: MD TopicCategoryCode
domain code: 009
comment: health, health services, human ecology, and safety Examples: disease and illness, factors affecting health, hygiene, substance abuse, mental and physical health, health services

imageryBaseMapsEarthCover
type: MD TopicCategoryCode
domain code: 010
comment: base maps Examples: land cover, topographic maps, imagery, unclassified images, annotations

intelligenceMilitary
type: MD TopicCategoryCode
domain code: 011
comment: military bases, structures, activities Examples: barracks, training grounds, military transportation, information collection

inlandWaters
type: MD TopicCategoryCode
domain code: 012
comment: inland water features, drainage systems and their characteristics Examples: rivers and glaciers, salt lakes, water utilization plans, dams, currents, floods, water quality, hydrographic charts

location
type: MD TopicCategoryCode
domain code: 013
comment: positional information and services Examples: addresses, geodetic networks, control points, postal zones and services, place names

oceans
type: MD TopicCategoryCode
domain code: 014
comment: features and characteristics of salt water bodies (excluding inland waters) Examples: tides, tidal waves, coastal information, reefs

planningCadastre
type: MD TopicCategoryCode
domain code: 015
comment: information used for appropriate actions for future use of the land Examples: land use maps, zoning maps, cadastral surveys, land ownership

society
type: MD TopicCategoryCode
domain code: 016
comment: characteristics of society and cultures Examples: settlements, anthropology, archaeology, education, traditional beliefs, manners and customs, demographic data, recreational areas and activities, social impact assessments, crime and justice, census information

structure
type: MD TopicCategoryCode
domain code: 017
comment: man-made construction Examples: buildings, museums, churches, factories, housing, monuments, shops, towers

transportation
type: MD TopicCategoryCode
domain code: 018
comment: means and aids for conveying persons and/or goods Examples: roads, airports/airstrips, shipping routes, tunnels, nautical charts, vehicle or vessel location, aeronautical charts, railways

utilitiesCommunication
type: MD TopicCategoryCode
domain code: 019
comment: energy, water and waste systems and communications infrastructure and services Examples: hydroelectricity, geothermal, solar and nuclear sources of energy, water purification and distribution, sewage collection and disposal, electricity and gas distribution, data communication, telecommunication, radio, communication networks

MD MaintenanceFrequenceCode
type: Class
stereotypes: CodeList
domain code: MainFreqCd
comment: frequency with which modifications and deletions are made to the data after it is first produced
equivalent class: Class
  one of: continual
  one of: daily
  one of: weekly
  one of: fortnightly
  one of: monthly
  one of: quarterly
  one of: biannually
  one of: annually
  one of: asNeeded
  one of: iiregular
  one of: notPlanned
  one of: unknow

continual
type: MD MaintenanceFrequenceCode
domain code: 001
comment: data is repeatedly and frequently updated

daily
type: MD MaintenanceFrequenceCode
domain code: 002
comment: data is updated each day

weekly
type: MD MaintenanceFrequenceCode
domain code: 003
comment: data is updated on a weekly basis

fortnightly
type: MD MaintenanceFrequenceCode
domain code: 004
comment: data is updated every two weeks

monthly
type: MD MaintenanceFrequenceCode
domain code: 005
comment: data is updated each month

quarterly
type: MD MaintenanceFrequenceCode
domain code: 006
comment: data is updated every three months

biannually
type: MD MaintenanceFrequenceCode
domain code: 007
comment: data is updated twice each year

annually
type: MD MaintenanceFrequenceCode
domain code: 008
comment: data is updated every year

asNeeded
type: MD MaintenanceFrequenceCode
domain code: 009
comment: data is updated as deemed necessary

iiregular
type: MD MaintenanceFrequenceCode
domain code: 010
comment: data is updated in intervals that are uneven in duration

notPlanned
type: MD MaintenanceFrequenceCode
domain code: 011
comment: there are no plans to update the data

unknow
type: MD MaintenanceFrequenceCode
domain code: 012
comment: frequency of maintenance for the data is not known

MD ClassificationCode
type: Class
stereotypes: codelist
domain code: ClasscationCd
comment: name of the handling restrictions on the dataset
equivalent class: Class
  one of: unclassified
  one of: restricted ClasscationCd
  one of: confidential
  one of: secret
  one of: topsecret

unclassified
type: MD ClassificationCode
domain code: 001
comment: available for general disclosure

restricted ClasscationCd
type: MD ClassificationCode
domain code: 002
comment: not for general disclosure

confidential
type: MD ClassificationCode
domain code: 003
comment: available for someone who can be entrusted with information

secret
type: MD ClassificationCode
domain code: 004
comment: kept or meant to be kept private, unknown, or hidden from all but a select group of people

topsecret
type: MD ClassificationCode
domain code: 005
comment: of the highest secrecy

MD Resolution
type: Class
stereotypes: class
comment: level of detail expressed as a scale factor or a ground distance
short name: Resol
subclass of: Restriction
  on property: distance
  cardinality: 1
subclass of: Restriction
  on property: equivalentScale
  cardinality: 1

distance
type: ObjectProperty
type: FunctionalProperty
domain: MD Resolution
comment: ground sample distance
short name: scaleDist
range: Distance
condition: distance not documented?

equivalentScale
type: ObjectProperty
type: FunctionalProperty
short name: equScale
domain: MD Resolution
comment: level of detail expressed as the scale of a comparable hardcopy map or chart
range: MD RepresentativeFraction
condition: distance not documented?

MD CellGeometryCode
type: Class
stereotypes: codelist
comment: code indicating whether grid data is point or area
equivalent class: Class
  one of: point CellGeoCd
  one of: area
domain code: CellGeoCd

point CellGeoCd
type: MD CellGeometryCode
domain code: 001
comment: each cell represents a point

area
type: MD CellGeometryCode
domain code: 002
comment: each cell represents an area

MD SpatialRepresentationTypeCode
type: Class
stereotypes: codelist
domain code: SpatRepTypCd
comment: method used to represent geographic information in the dataset
equivalent class: Class
  one of: vector
  one of: grid
  one of: textTable
  one of: tin
  one of: stereoModel
  one of: video

vector
type: MD SpatialRepresentationTypeCode
domain code: 001
comment: vector data is used to represent geographic data

grid
type: MD SpatialRepresentationTypeCode
domain code: 002
comment: grid data is used to represent geographic data

textTable
type: MD SpatialRepresentationTypeCode
domain code: 003
comment: textual or tabular data is used to represent geographic data

tin
type: MD SpatialRepresentationTypeCode
domain code: 004
comment: triangulated irregular network

video
type: MD SpatialRepresentationTypeCode
domain code: 006
comment: scene from a video recording

MD Georeferenceable
type: Class
stereotypes: class
subclass of: MD GridSpatialRepresentation
subclass of: Restriction
  on property: orientationParameterAvailibility
  cardinality: 1
subclass of: Restriction
  on property: parameters
  cardinality: 1
subclass of: Restriction
  on property: orientationParameterAvailibility
  max cardinality: 1
subclass of: Restriction
  on property: orientationParameterAvailibility
  min cardinality: 0
subclass of: Restriction
  on property: parameterCitation
  min cardinality: 0
subclass of: Restriction
  on property: controlPointAvailability
  cardinality: 1
comment: grid with cells irregularly spaced in any given geographic/map projection coordinate system, whose individual cells can be geolocated using geolocation information supplied with the data but cannot be geolocated from the grid properties alone
short name: Georef

MD GridSpatialRepresentation
type: Class
stereotypes: class
subclass of: MD SpatialRepresentation
subclass of: Restriction
  on property: numberOfDimensions
  cardinality: 1
subclass of: Restriction
  on property: axisDimensionProperties
  cardinality: 1
subclass of: Restriction
  on property: cellGeometry
  cardinality: 1
subclass of: Restriction
  on property: transformationParameterAvailabiliy
  cardinality: 1
comment: information about grid spatial objects in the dataset
short name: GridSpatRep

orientationParameterAvailibility
type: DatatypeProperty
type: FunctionalProperty
range: boolean
domain: MD Georeferenceable
comment: indication of whether or not orientation parameters are available
short name: orieParaAv

parameters
type: ObjectProperty
type: FunctionalProperty
domain: MD Georeferenceable
comment: terms which support grid data georeferencing
range: Record
short name: georefPars

parameterCitation
type: ObjectProperty
domain: MD Georeferenceable
comment: reference providing description of the parameters
range: CI Citation
short name: paraCit

controlPointAvailability
type: DatatypeProperty
type: FunctionalProperty
domain: MD Georeferenceable
range: boolean
comment: indication of whether or not control point(s) exists
short name: ctrlPtAv

EX GeographicBoundingBox
type: Class
stereotypes: class
subclass of: EX GeographicExtent
subclass of: Restriction
  on property: eastBoundLongitude
  cardinality: 1
subclass of: Restriction
  on property: westBoundLongitude
  cardinality: 1
subclass of: Restriction
  on property: southBoundLatitude
  cardinality: 1
subclass of: Restriction
  on property: northBoundLatitude
  cardinality: 1
comment: geographic position of the dataset NOTE This is only an approximate reference so specifying the co-ordinate system is unnecessary
short name: GeoBndBox

eastBoundLongitude
type: ObjectProperty
type: FunctionalProperty
domain: EX GeographicBoundingBox
range: Angle
comment: eastern-most coordinate of the limit of the dataset extent, expressed in longitude in decimal degrees (positive east)
short name: eastBL

westBoundLongitude
type: FunctionalProperty
type: ObjectProperty
domain: EX GeographicBoundingBox
range: Angle
comment: western-most coordinate of the limit of the dataset extent, expressed in longitude in decimal degrees (positive east)
short name: westBL

southBoundLatitude
type: FunctionalProperty
type: ObjectProperty
domain: EX GeographicBoundingBox
range: Angle
comment: southern-most coordinate of the limit of the dataset extent, expressed in latitude in decimal degrees (positive north)
short name: southBL

northBoundLatitude
type: FunctionalProperty
type: ObjectProperty
domain: EX GeographicBoundingBox
range: Angle
comment: northern-most, coordinate of the limit of the dataset extent expressed in latitude in decimal degrees (positive north)
short name: northBL

EX SpatialTemporalExtent
type: Class
stereotypes: class
subclass of: EX TemporalExtent
subclass of: Restriction
  on property: spatialExtent
  min cardinality: 1
comment: extent with respect to date/time and spatial boundaries
short name: SpatTempEx

spatialExtent
type: ObjectProperty
short name: exSpat
domain: EX SpatialTemporalExtent
range: EX GeographicExtent
comment: spatial extent component of composite spatial and temporal extent

DQ AbsoluteExtemalPositionalAccuracy
type: Class
stereotypes: class
subclass of: DQ PositionAccuracy
comment: closeness of reported coordinate values to values accepted as or being true
short name: DQAbsExtPosAcc

UomLength
type: Class
stereotypes: class

DQ DomainConsistency
type: Class
stereotypes: class
subclass of: DQ LogicalConsistency
comment: adherence of values to the value domains
short name: DQDomConsis

MD VectorSpatialRepresentation
type: Class
stereotypes: class
subclass of: MD SpatialRepresentation
subclass of: Restriction
  on property: topologyLevel
  min cardinality: 0
subclass of: Restriction
  on property: topologyLevel
  max cardinality: 1
subclass of: Restriction
  on property: geometricObjects
  min cardinality: 0
comment: information about the vector spatial objects in the dataset
short name: VectSpatRep

topologyLevel
type: ObjectProperty
type: FunctionalProperty
domain: MD VectorSpatialRepresentation
comment: code which identifies the degree of complexity of the spatial relationships
range: MD TopologyLevelCode
short name: topLvl

geometricObjects
type: ObjectProperty
type: SymmetricProperty
domain: MD VectorSpatialRepresentation
comment: information about the geometric objects used in the dataset
range: MD GeometricObjects
short name: geometObjs

Date
type: Class
stereotypes: class

MD ObliqueLinePoint
type: Class
stereotypes: class
subclass of: Restriction
  on property: obliqueLineLatitude
  cardinality: 1
subclass of: Restriction
  on property: obliqueLineLongitude
  cardinality: 1
comment: method used to describe the line along which an oblique mercator map projection is centred using two points near the limits of the mapped region that define the centre line
short name: ObLinePt

obliqueLineLatitude
type: DatatypeProperty
type: FunctionalProperty
domain: MD ObliqueLinePoint
range: float
comment: latitude of a point defining the oblique line
short name: obLineLat

obliqueLineLongitude
type: DatatypeProperty
type: FunctionalProperty
domain: MD ObliqueLinePoint
range: float
comment: longitude of a point defining the oblique line
short name: obLineLong

DQ DataQuality
type: Class
stereotypes: class
subclass of: Restriction
  on property: lineage
  min cardinality: 0
subclass of: Restriction
  on property: report
  min cardinality: 0
subclass of: Restriction
  on property: scope
  cardinality: 1
subclass of: Restriction
  on property: lineage
  max cardinality: 1
comment: quality information for the data specified by a data quality scope
short name: DataQual

lineage
type: ObjectProperty
type: FunctionalProperty
domain: DQ DataQuality
range: LI Lineage
comment: non-quantitative quality information about the lineage of the data specified by the scope
short name: dataLineage
condition: scope.DQ_Scope.level equals “dataset”?

report
type: ObjectProperty
domain: DQ DataQuality
comment: quantitative quality information for the data specified by the scope
range: DQ Element
short name: dqReport
condition: scope.DQ_Scope.level equals “dataset”?

scope
type: ObjectProperty
type: FunctionalProperty
domain: DQ DataQuality
comment: the specific data to which the data quality information applies
range: DQ Scope
short name: dqScope

CI DateTypeCode
type: Class
stereotypes: codelist
domain code: DateTypCd
comment: identification of when a given event occurred
equivalent class: Class
  one of: creation
  one of: publication
  one of: revision

creation
type: CI DateTypeCode
domain code: 001
comment: date identifies when the resource was brought into existence

publication
type: CI DateTypeCode
domain code: 002
comment: date identifies when the resource was issued

revision
type: CI DateTypeCode
domain code: 003
comment: date identifies when the resource was examined or re-examined and improved or amended

CI ResponsibleParty
type: Class
stereotypes: datatypeClass
subclass of: Restriction
  on property: individualName
  min cardinality: 0
subclass of: Restriction
  on property: organisationName
  min cardinality: 0
subclass of: Restriction
  on property: positionName
  min cardinality: 0
subclass of: Restriction
  on property: contactInfo
  min cardinality: 0
subclass of: Restriction
  on property: role
  cardinality: 1
subclass of: Restriction
  on property: individualName
  max cardinality: 1
subclass of: Restriction
  on property: organisationName
  max cardinality: 1
subclass of: Restriction
  on property: positionName
  max cardinality: 1
subclass of: Restriction
  on property: contactInfo
  max cardinality: 1
comment: identification of, and means of communication with, person(s) and organizations associated with the dataset
short name: RespParty

individualName
type: DatatypeProperty
type: FunctionalProperty
range: string
domain: CI ResponsibleParty
condition: organizationName and positionName not documented ?
comment: name of the responsible person- surname, given name, title separated by a delimiter
short name: rpIndName

organisationName
type: DatatypeProperty
type: FunctionalProperty
range: string
domain: CI ResponsibleParty
condition: individual and positionName not documented ?
comment: name of the responsible organization
short name: rpOrgName

positionName
type: DatatypeProperty
type: FunctionalProperty
range: string
domain: CI ResponsibleParty
condition: individual and organizationName not documented ?
comment: role or position of the responsible person
short name: rpPosName

contactInfo
type: ObjectProperty
type: FunctionalProperty
domain: CI ResponsibleParty
range: CI Contact
comment: address of the responsible party
short name: rpCntInfo

role
type: ObjectProperty
type: FunctionalProperty
short name: role
domain: CI ResponsibleParty
range: CI RoleCode
comment: function performed by the responsible party

name refSysName
type: ObjectProperty
type: FunctionalProperty
domain: RS ReferenceSystem
range: RS Identifier
comment: name of reference system used
short name: refSysName

domainOfValidity
type: ObjectProperty
domain: RS ReferenceSystem
range: EX Extent
comment: range which is valid for the reference system
short name: domOValid

EX GeographicDescription
type: Class
stereotypes: class
subclass of: EX GeographicExtent
subclass of: Restriction
  on property: geographicIdentifier
  cardinality: 1
comment: Description of the geographic area using identifiers
short name: GeoDesc

geographicIdentifier
type: FunctionalProperty
type: ObjectProperty
domain: EX GeographicDescription
range: MD Identifier
comment: identifier used to represent a geographic area
short name: geoId

MD SpatialAttributeSupplement
type: Class
stereotypes: class
subclass of: Restriction
  on property: theFeatureTypeList
  min cardinality: 1
comment: spatial attributes in the application schema for the feature types
short name: SpatAttSup

theFeatureTypeList
type: ObjectProperty
domain: MD SpatialAttributeSupplement
comment: provides information about the list of feature types with the same spatial representation
short name: featTypeList
range: MD FeatureTypeList

MD MetadataExtensionInformation
type: Class
stereotypes: class
subclass of: Restriction
  on property: extensionOnLineResource
  min cardinality: 0
subclass of: Restriction
  on property: extensionOnLineResource
  max cardinality: 1
subclass of: Restriction
  on property: extendedElementInformation
  min cardinality: 0
comment: information describing metadata extensions
short name: MdExtInfo

extensionOnLineResource
type: ObjectProperty
type: FunctionalProperty
domain: MD MetadataExtensionInformation
comment: information about on-line sources containing the community profile name and the extended metadata elements. Information for all new metadata elements
range: CI OnlineResource
short name: extOnRes

extendedElementInformation
type: ObjectProperty
domain: MD MetadataExtensionInformation
range: MD ExtendedElementInformation
comment: provides information about a new metadata element, not found in ISO 19115, which is required to describe geographic data
short name: extEleInfo

GM Object
type: Class
stereotypes: class

MD ExtendedElementInformation
type: Class
stereotypes: class
subclass of: Restriction
  cardinality: 1
  on property: name extEleName
subclass of: Restriction
  on property: rule
  cardinality: 1
subclass of: Restriction
  cardinality: 1
  on property: dataType
subclass of: Restriction
  min cardinality: 0
  on property: shortName extShortName
subclass of: Restriction
  max cardinality: 1
  on property: shortName extShortName
subclass of: Restriction
  min cardinality: 0
  on property: domainCode extDomCode
subclass of: Restriction
  max cardinality: 1
  on property: domainCode extDomCode
subclass of: Restriction
  on property: obligation
  min cardinality: 0
subclass of: Restriction
  on property: obligation
  max cardinality: 1
subclass of: Restriction
  min cardinality: 0
  on property: condition extEleCond
subclass of: Restriction
  max cardinality: 1
  on property: condition extEleCond
subclass of: Restriction
  on property: maximumOccurance
  min cardinality: 0
subclass of: Restriction
  on property: maximumOccurance
  max cardinality: 1
subclass of: Restriction
  on property: domainValue
  min cardinality: 0
subclass of: Restriction
  on property: domainValue
  max cardinality: 1
subclass of: Restriction
  on property: parentEntity
  min cardinality: 1
subclass of: Restriction
  cardinality: 1
  on property: definition exEleDef
subclass of: Restriction
  min cardinality: 1
  on property: source extEleSrc
subclass of: Restriction
  max cardinality: 0
  on property: rationale extEleRat
subclass of: Restriction
  max cardinality: 1
  on property: rationale extEleRat
comment: new metadata element, not found in ISO 19115, which is required to describe geographic data
short name: ExtEleInfo

name extEleName
type: DatatypeProperty
type: FunctionalProperty
range: string
domain: MD ExtendedElementInformation
comment: name of the extended metadata element.
short name: extEleName

rule
type: DatatypeProperty
type: FunctionalProperty
range: string
domain: MD ExtendedElementInformation
comment: specifies how the extended element relates to other existing elements and entities
short name: extEleRule

dataType
type: ObjectProperty
type: FunctionalProperty
domain: MD ExtendedElementInformation
comment: code which identifies the kind of value provided in the extended element
range: MD DataTypeCode
short name: eleDataType

shortName extShortName
type: DatatypeProperty
type: FunctionalProperty
range: string
domain: MD ExtendedElementInformation
comment: short form suitable for use in an implementation method such as XML or SGML. NOTE other methods may be used
condition: dataType notEqual “codelistElement”?
short name: extShortName

domainCode extDomCode
type: DatatypeProperty
type: FunctionalProperty
domain: MD ExtendedElementInformation
range: int
comment: three digit code assigned to the extended element
condition: is dataType “codelistElement”?
short name: extDomCode

obligation
type: ObjectProperty
type: FunctionalProperty
domain: MD ExtendedElementInformation
comment: obligation of the extended element
range: MD ObligationCode
condition: dataType not “codelist”, “enumeration” or “codelistElement”?
short name: extEleOb

condition extEleCond
type: DatatypeProperty
type: FunctionalProperty
range: string
domain: MD ExtendedElementInformation
comment: condition under which the extended element is mandatory
condition: obligation = “Conditional”?
short name: extEleCond

maximumOccurance
type: DatatypeProperty
type: FunctionalProperty
range: string
domain: MD ExtendedElementInformation
comment: maximum occurrence of the extended element
condition: dataType not “codelist”, “enumeration” or “codelistElement”?
short name: extEleMxOc

domainValue
type: DatatypeProperty
type: FunctionalProperty
range: string
domain: MD ExtendedElementInformation
comment: valid values that can be assigned to the extended element
condition: dataType not codelist, enumeration or codelistElement?
short name: extEleDomVal

parentEntity
type: DatatypeProperty
range: string
domain: MD ExtendedElementInformation
comment: name of the metadata entity(s) under which this extended metadata element may appear. The name(s) may be standard metadata element(s) or other extended metadata element(s).
short name: extEleParEnt

definition exEleDef
type: DatatypeProperty
type: FunctionalProperty
domain: MD ExtendedElementInformation
range: string
comment: definition of the extended element
short name: extEleDef

source extEleSrc
type: ObjectProperty
domain: MD ExtendedElementInformation
comment: name of the person or organization creating the extended element
range: CI ResponsibleParty
short name: extEleSrc

rationale extEleRat
type: DatatypeProperty
range: string
domain: MD ExtendedElementInformation
comment: reason for creating the extended element
short name: extEleRat

MD Usage
type: Class
stereotypes: class
subclass of: Restriction
  on property: usageDateTime
  min cardinality: 0
subclass of: Restriction
  on property: userDeterminedLimitations
  min cardinality: 0
subclass of: Restriction
  on property: userContactInfo
  min cardinality: 1
subclass of: Restriction
  on property: specificUsage
  cardinality: 1
subclass of: Restriction
  on property: usageDateTime
  max cardinality: 1
subclass of: Restriction
  on property: userDeterminedLimitations
  max cardinality: 1
comment: brief description of ways in which the resource(s) is/are currently used
short name: Usage

usageDateTime
type: FunctionalProperty
type: ObjectProperty
domain: MD Usage
range: DateTime
comment: date and time of the first use or range of uses of the resource and/or resource series
short name: usageDate

userDeterminedLimitations
type: DatatypeProperty
type: FunctionalProperty
range: string
domain: MD Usage
comment: applications, determined by the user for which the resource and/or resource series is not suitable
short name: usrDetLim

userContactInfo
type: ObjectProperty
domain: MD Usage
range: CI ResponsibleParty
comment: identification of and means of communicating with person(s) and organization(s) using the resource(s)
short name: usrCntInfo

specificUsage
type: DatatypeProperty
type: FunctionalProperty
range: string
domain: MD Usage
comment: brief description of the resource and/or resource series usage
short name: specUsage

MD DimensionNameTypeCode
type: Class
stereotypes: codelist
short name: DimNameTypCd
comment: name of the dimension
equivalent class: Class
  one of: row
  one of: column
  one of: vertical
  one of: track
  one of: crossTrack
  one of: line
  one of: sample
  one of: time

row
type: MD DimensionNameTypeCode
domain code: 001
comment: ordinate y axis

column
type: MD DimensionNameTypeCode
domain code: 002
comment: abscissa x axis

vertical
type: MD DimensionNameTypeCode
domain code: 003
comment: vertical z axis

track
type: MD DimensionNameTypeCode
domain code: 004
comment: along the direction of motion of the scan point

crossTrack
type: MD DimensionNameTypeCode
domain code: 005
comment: perpendicular to the direction of motion of the scan point

line
type: MD DimensionNameTypeCode
domain code: 006
comment: scan line of a sensor

sample
type: MD DimensionNameTypeCode
domain code: 007
comment: element along a scan line

time
type: MD DimensionNameTypeCode
domain code: 008
comment: duration

MD TopologyLevelCode
type: Class
stereotypes: codelist
comment: degree of complexity of the spatial relationships
domain code: TopoLevCd
equivalent class: Class
  one of: geometryOnly
  one of: topology1D
  one of: planarGraph
  one of: fullPlanarGraph
  one of: surfaceGraph
  one of: fullSurfaceGraph
  one of: topology3D
  one of: fullTopology3D
  one of: abstract TopoLevCd

geometryOnly
type: MD TopologyLevelCode
domain code: 001
comment: geometry objects without any additional structure which describes topology

topology1D
type: MD TopologyLevelCode
domain code: 002
comment: 1-dimensional topological complex

planarGraph
type: MD TopologyLevelCode
domain code: 003
comment: 1-dimensional topological complex which is planar

fullPlanarGraph
type: MD TopologyLevelCode
domain code: 004
comment: 2-dimensional topological complex which is planar

surfaceGraph
type: MD TopologyLevelCode
domain code: 005
comment: 1-dimensional topological complex which is isomorphic to a subset of a surface

fullSurfaceGraph
type: MD TopologyLevelCode
domain code: 006
comment: 2-dimensional topological complex which is isomorphic to a subset of a surface

topology3D
type: MD TopologyLevelCode
domain code: 007
comment: 3-dimensional topological complex

fullTopology3D
type: MD TopologyLevelCode
domain code: 008
comment: complete coverage of a 3D coordinate space

abstract TopoLevCd
type: MD TopologyLevelCode
domain code: 009
comment: topological complex without any specified geometric realization

DQ Scope
type: Class
stereotypes: datatypeClass
subclass of: Restriction
  on property: level
  min cardinality: 1
subclass of: Restriction
  min cardinality: 0
  on property: extent scpExt
subclass of: Restriction
  on property: levelDescription
  min cardinality: 0
subclass of: Restriction
  max cardinality: 1
  on property: extent scpExt
comment: description of the data specified by the scope
short name: DQScope

level
type: ObjectProperty
domain: DQ Scope
comment: hierarchical level of the data specified by the scope
range: MD ScopeCode
short name: scpLvl

extent scpExt
type: ObjectProperty
type: FunctionalProperty
domain: DQ Scope
range: EX Extent
comment: information about the spatial, vertical and temporal extent of the data specified by the scope
short name: scpExt

levelDescription
type: ObjectProperty
domain: DQ Scope
range: MD ScopeDescription
comment: detailed description about the level of the data specified by the scope
short name: scpLvlDesc
condition: level not equal “dataset” or “series”?

CI Telephone
type: Class
stereotypes: datatypeClass
subclass of: Restriction
  on property: voice
  min cardinality: 0
subclass of: Restriction
  on property: fascimile
  min cardinality: 0
comment: telephone numbers for contacting the responsible individual or organization
short name: Telephone

voice
type: DatatypeProperty
range: string
domain: CI Telephone
comment: telephone number by which individuals can speak to the responsible organization or individual
short name: voiceNum

fascimile
type: DatatypeProperty
range: string
domain: CI Telephone
comment: telephone number of a facsimile machine for the responsible organization or individual
short name: faxNum

DateTime
type: Class
stereotypes: class

MD CharacterSetCode
type: Class
stereotypes: codelist
domain code: CharSetCd
comment: name of the character coding standard used for the resource
equivalent class: Class
  one of: ucs2
  one of: ucs4
  one of: utf7
  one of: utf8
  one of: utf16
  one of: 8895part1
  one of: 8895part2
  one of: 8895part3
  one of: 8895part5
  one of: 8895part4
  one of: 8895part6
  one of: 8895part7
  one of: 8895part8
  one of: 8895part9
  one of: 8895part11
  one of: 8895part14
  one of: 8895part15
  one of: jis
  one of: shiftJIS
  one of: eucJP
  one of: usAscii
  one of: ebcdic
  one of: eucKR
  one of: big5

ucs2
type: MD CharacterSetCode
domain code: 001
comment: 16-bit fixed size Universal Character Set, based on ISO/IEC 10646

ucs4
type: MD CharacterSetCode
domain code: 002
comment: 32-bit fixed size Universal Character Set, based on ISO/IEC 10646

utf7
type: MD CharacterSetCode
domain code: 003
comment: 7-bit variable size UCS Transfer Format, based on ISO/IEC 10646

utf8
type: MD CharacterSetCode
domain code: 004
comment: 8-bit variable size UCS Transfer Format, based on ISO/IEC 10646

utf16
type: MD CharacterSetCode
domain code: 005
comment: 16-bit variable size UCS Transfer Format, based on ISO/IEC 10646

8895part1
type: MD CharacterSetCode
domain code: 006
comment: latin-1, west European code set

8895part2
type: MD CharacterSetCode
domain code: 007
comment: latin-2, central European code set

8895part3
type: MD CharacterSetCode
domain code: 008
comment: latin-3, south European code set

8895part5
type: MD CharacterSetCode
domain code: 010
comment: cyrillic code set

8895part4
type: MD CharacterSetCode
domain code: 009
comment: latin-4, north European code set

8895part6
type: MD CharacterSetCode
domain code: 011
comment: arabic code set

8895part7
type: MD CharacterSetCode
domain code: 012
comment: greek code set

8895part8
type: MD CharacterSetCode
domain code: 013
comment: hebrew code set

8895part9
type: MD CharacterSetCode
domain code: 014
comment: latin-5, Turkish code set

8895part11
type: MD CharacterSetCode
domain code: 015
comment: thai code set

8895part14
type: MD CharacterSetCode
domain code: 016
comment: latin-8 code set

8895part15
type: MD CharacterSetCode
domain code: 017
comment: latin-9 code set

jis
type: MD CharacterSetCode
domain code: 018
comment: japanese code set used for electronic transmission

shiftJIS
type: MD CharacterSetCode
domain code: 019
comment: japanese code set used on MS-DOS based machines

eucJP
type: MD CharacterSetCode
domain code: 020
comment: japanese code set used on UNIX based machines

usAscii
type: MD CharacterSetCode
domain code: 021
comment: united states ASCII code set (ISO 646 US)

ebcdic
type: MD CharacterSetCode
domain code: 022
comment: ibm mainframe code set

eucKR
type: MD CharacterSetCode
domain code: 023
comment: korean code set

big5
type: MD CharacterSetCode
domain code: 024
comment: taiwanese code set

numberOfDimensions
type: DatatypeProperty
type: FunctionalProperty
domain: MD GridSpatialRepresentation
range: int
comment: number of independent spatial-temporal axes
short name: numDims

axisDimensionProperties
type: ObjectProperty
domain: MD GridSpatialRepresentation
comment: information about spatial-temporal axis properties
range: MD Dimension
short name: axDimProps

cellGeometry
type: ObjectProperty
type: FunctionalProperty
domain: MD GridSpatialRepresentation
comment: identification of grid data as point or cell
range: MD CellGeometryCode
short name: cellGeo

transformationParameterAvailabiliy
type: DatatypeProperty
type: FunctionalProperty
domain: MD GridSpatialRepresentation
range: boolean
comment: indication of whether or not parameters for transformation exists
short name: tranParaAv

descriptor
type: DatatypeProperty
type: FunctionalProperty
range: string
domain: MD RangeDimension
comment: description of the range of a cell measurement value
short name: dimDescrp

sequenceIdentifier
type: ObjectProperty
type: FunctionalProperty
domain: MD RangeDimension
comment: number that uniquely identifies instances of bands of wavelengths on which a sensor operates
range: MemberName
short name: seqID

Binary
type: Class
stereotypes: class

MD ScopeDescription
type: Class
stereotypes: unionClass
subclass of: Restriction
  on property: other
  cardinality: 1
subclass of: Restriction
  on property: features
  cardinality: 1
subclass of: Restriction
  on property: featureInstances
  cardinality: 1
subclass of: Restriction
  on property: attributeInstances
  cardinality: 1
subclass of: Restriction
  on property: dataset datasetSet
  cardinality: 1
subclass of: Restriction
  on property: attributes
  cardinality: 1
comment: description of the class of information covered by the information
short name: ScpDesc

other
type: DatatypeProperty
type: FunctionalProperty
range: string
domain: MD ScopeDescription
condition: attribute, features, featureInstances, attributeInstances and dataset not documented ?
comment: class of information that does not fall into the other categories to which the information applies
short name: other

features
type: FunctionalProperty
type: ObjectProperty
domain: MD ScopeDescription
range: GF FeatureType
condition: attributes, featureInstancess, attributeInstances, dataset and other not documented ?
comment: features to which the information applies
short name: featSet

featureInstances
type: FunctionalProperty
type: ObjectProperty
domain: MD ScopeDescription
range: GF FeatureType
condition: attributes, features, attributeInstances, dataset and other not documented ?
comment: feature instances to which the information applies
short name: featIntSet

attributeInstances
type: FunctionalProperty
type: ObjectProperty
domain: MD ScopeDescription
range: GF AttributeType
condition: attribute, features, featureInstances, dataset and other not documented ?
comment: attribute instances to which the information applies
short name: attribIntSet

dataset datasetSet
type: DatatypeProperty
type: FunctionalProperty
range: string
domain: MD ScopeDescription
condition: attribute, features, featureInstances, attributeInstances and other not documented ?
comment: dataset to which the information applies
short name: datasetSet

attributes
type: ObjectProperty
type: FunctionalProperty
domain: MD ScopeDescription
range: GF AttributeType
condition: features, featureInstances, attributeInstances, dataset and other not documented ?
comment: attributes to which the information applies
short name: attribSet

MD Georectified
type: Class
stereotypes: class
subclass of: MD GridSpatialRepresentation
subclass of: Restriction
  on property: checkPointAvailability
  cardinality: 1
subclass of: Restriction
  on property: pointInPixel
  cardinality: 1
subclass of: Restriction
  on property: cornerPoints
  cardinality: 1
subclass of: Restriction
  on property: checkPointDescription
  min cardinality: 0
subclass of: Restriction
  on property: centerPoint
  max cardinality: 1
subclass of: Restriction
  on property: transformationDimensionDescription
  max cardinality: 1
subclass of: Restriction
  on property: transformationDimensionMapping
  max cardinality: 2
subclass of: Restriction
  on property: transformationDimensionMapping
  min cardinality: 0
subclass of: Restriction
  on property: transformationDimensionDescription
  min cardinality: 0
subclass of: Restriction
  on property: centerPoint
  min cardinality: 0
subclass of: Restriction
  on property: checkPointDescription
  max cardinality: 1
comment: grid whose cells are regularly spaced in a geographic (i.e., lat / long) or map coordinate system defined in the Spatial Referencing System (SRS) so that any cell in the grid can be geolocated given its grid coordinate and the grid origin, cell spacing, and orientation
short name: Georect

checkPointAvailability
type: DatatypeProperty
type: FunctionalProperty
range: boolean
domain: MD Georectified
comment: indication of whether or not geographic position points are available to test the accuracy of the georeferenced grid data
short name: chkPtAv

pointInPixel
type: FunctionalProperty
type: ObjectProperty
domain: MD Georectified
comment: point in a pixel corresponding to the Earth location of the pixel
range: MD PixelOrientationCode
short name: ptInPixel

cornerPoints
type: ObjectProperty
type: FunctionalProperty
domain: MD Georectified
comment: earth location in the coordinate system defined by the Spatial Reference System and the grid coordinate of the cells at opposite ends of grid coverage along two diagonals in the grid spatial dimensions. There are four corner points in a georectified grid; at least two corner points along one diagonal are required
range: GM Point
short name: cornerPts

checkPointDescription
type: DatatypeProperty
type: FunctionalProperty
range: string
domain: MD Georectified
comment: description of geographic position points used to test the accuracy of the georeferenced grid data
short name: chkPtDesc
condition: checkPointAvailability equals “yes”?

centerPoint
type: ObjectProperty
type: FunctionalProperty
domain: MD Georectified
comment: earth location in the coordinate system defined by the Spatial Reference System and the grid coordinate of the cell halfway between opposite ends of the grid in the spatial dimensions
range: GM Point
short name: centerPt

transformationDimensionDescription
type: DatatypeProperty
type: FunctionalProperty
range: string
domain: MD Georectified
comment: description of the information about which grid dimensions are the spatial dimensions
short name: transDimDesc

transformationDimensionMapping
type: DatatypeProperty
range: string
domain: MD Georectified
comment: information about which grid dimensions are the spatial dimensions
short name: transDimMap

MD ProgressCode
type: Class
stereotypes: codelist
domain code: ProgCd
comment: status of the dataset or progress of a review
equivalent class: Class
  one of: completed
  one of: historicalArchive
  one of: obsolete
  one of: onGoing
  one of: planned
  one of: required
  one of: underdevelopment

completed
type: MD ProgressCode
domain code: 001
comment: production of the data has been completed

historicalArchive
type: MD ProgressCode
domain code: 002
comment: data has been stored in an offline storage facility

obsolete
type: MD ProgressCode
domain code: 003
comment: data is no longer relevant

onGoing
type: MD ProgressCode
domain code: 004
comment: data is continually being updated

planned
type: MD ProgressCode
domain code: 005
comment: fixed date has been established upon or by which the data will be created or updated

required
type: MD ProgressCode
domain code: 006
comment: data needs to be generated or updated

underdevelopment
type: MD ProgressCode
domain code: 007
comment: data is currently in the process of being created

MD RepresentativeFraction
type: Class
stereotypes: datatypeClass
comment: derived from Scale where MD_RepresentativeFraction.denominator = 1 / Scale.measure And Scale.targetUnits = Scale.sourceUnits
short name: RepFract
subclass of: Restriction
  on property: denominator
  cardinality: 1
subclass of: Restriction
  on property: scale
  cardinality: 1

denominator
type: DatatypeProperty
type: FunctionalProperty
short name: rfDenom
domain: MD RepresentativeFraction
range: int
comment: the number below the line in a vulgar fraction

scale
type: ObjectProperty
type: FunctionalProperty
domain: MD RepresentativeFraction
comment: role indicating that MD_RepresentativeFraction is derived from Scale
range: Scale
short name: derScale

DQ ConceptualConsistency
type: Class
stereotypes: class
subclass of: DQ LogicalConsistency
comment: adherence to rules of the conceptual schema
short name: DQConcConsis

MD Medium
type: Class
stereotypes: datatypeClass
subclass of: Restriction
  min cardinality: 0
  on property: name medName
subclass of: Restriction
  max cardinality: 1
  on property: name medName
subclass of: Restriction
  on property: density
  min cardinality: 0
subclass of: Restriction
  on property: densityUnits
  min cardinality: 0
subclass of: Restriction
  on property: densityUnits
  max cardinality: 1
subclass of: Restriction
  on property: volumes
  min cardinality: 0
subclass of: Restriction
  on property: volumes
  max cardinality: 1
subclass of: Restriction
  on property: mediumFormat
  min cardinality: 0
subclass of: Restriction
  on property: mediumNote
  min cardinality: 0
subclass of: Restriction
  on property: mediumNote
  max cardinality: 1
comment: information about the media on which the resource can be distributed
short name: Medium

name medName
type: FunctionalProperty
type: ObjectProperty
domain: MD Medium
range: MD MediumNameCode
comment: name of the medium on which the resource can be received
short name: medName

density
type: DatatypeProperty
domain: MD Medium
range: float
comment: density at which the data is recorded
short name: medDensity

densityUnits
type: DatatypeProperty
type: FunctionalProperty
range: string
domain: MD Medium
condition: density documented ?
comment: units of measure for the recording density
short name: medDenUnits

volumes
type: DatatypeProperty
type: FunctionalProperty
domain: MD Medium
range: int
comment: number of items in the media identified
short name: medVol

mediumFormat
type: ObjectProperty
domain: MD Medium
range: MD MediumFormatCode
comment: method used to write to the medium
short name: medFormat

mediumNote
type: DatatypeProperty
type: FunctionalProperty
range: string
domain: MD Medium
comment: description of other limitations or requirements for using the medium
short name: medNote

DQ FormatConsistency
type: Class
stereotypes: class
subclass of: DQ LogicalConsistency
comment: degree to which data is stored in accordance with the physical structure of the dataset, as described by the scope
short name: DQFormConsis

referenceSystemIdentifier
type: FunctionalProperty
type: ObjectProperty
domain: MD ReferenceSystem
range: RS Identifier
condition: MD_CRS.projection, MD_CRS.ellipsoid, and MD_CRS.datum not documented ?
comment: name of reference system
short name: refSysID

referenceSystem
type: ObjectProperty
type: FunctionalProperty
domain: MD ReferenceSystem
range: RS ReferenceSystem
comment: relationship indicating that MD_ReferenceSystem (as well as its attributes and aggregates) is derived from RS_ReferenceSystem
short name: derRefSys

MD LegalConstraints
type: Class
stereotypes: class
subclass of: MD Constraints
subclass of: Restriction
  on property: otherConstraints
  min cardinality: 0
subclass of: Restriction
  on property: useConstraints
  min cardinality: 0
subclass of: Restriction
  on property: accessConstraints
  min cardinality: 0
comment: restrictions and legal prerequisites for accessing and using the resource
short name: LegConsts
subclass of: Restriction
  on property: accessConstraints
  min cardinality: 0
subclass of: Restriction
  on property: useConstraints
  min cardinality: 0
subclass of: Restriction
  on property: otherConstraints
  min cardinality: 0

otherConstraints
type: DatatypeProperty
range: string
domain: MD LegalConstraints
comment: other restrictions and legal prerequisites for accessing and using the resource
short name: othConsts
condition: accessConstraints or useConstraints equal “otherRestrictions”?

useConstraints
type: ObjectProperty
domain: MD LegalConstraints
comment: constraints applied to assure the protection of privacy or intellectual property, and any special restrictions or limitations or warnings on using the resource
short name: useConsts
range: MD RestrictionCode

accessConstraints
type: ObjectProperty
domain: MD LegalConstraints
comment: access constraints applied to assure the protection of privacy or intellectual property, and any special restrictions or limitations on obtaining the resource
range: MD RestrictionCode
short name: accessConsts

stereotypes
type: DatatypeProperty
type: AnnotationProperty
short name: strTyp
range: string
comment: stereotypes annotation for ISO 19115 ontology

domainCode
type: DatatypeProperty
type: AnnotationProperty
range: string
comment: describe domain code for codelist element

condition
type: DatatypeProperty
type: AnnotationProperty
range: string
comment: condition under which the extended element is mandatory
short name: extEleCond

orientationParameterDescription
type: DatatypeProperty
type: FunctionalProperty
range: string
domain: MD Georeferenceable
comment: description of parameters used to describe sensor orientation
short name: orieParaDs

defaultValue
type: DatatypeProperty
type: AnnotationProperty
short name: defValue
range: string
type: FunctionalProperty
comment: default Value for any ISO 19115 metadata element

definition
type: DatatypeProperty
type: FunctionalProperty
range: string
comment: definition of the extended element
domain: MD ExtendedElementInformation
short name: extEleDef

shortName
type: DatatypeProperty
type: AnnotationProperty
short name: shrtName
range: string
comment: Shortname used for Annotation