W3C home > Mailing lists > Public > www-validator@w3.org > February 2007

Re: LogValidator on OS X

From: Elliotte Harold <elharo@metalab.unc.edu>
Date: Thu, 01 Feb 2007 14:53:56 -0500
Message-ID: <45C24554.4020604@metalab.unc.edu>
To: olivier Thereaux <ot@w3.org>
CC: www-validator Community <www-validator@w3.org>

olivier Thereaux wrote:

> Could you paste the output of the installation procedure? Knowing which 
> tests fail, whether they are tests related to the log validator or 
> modules it depends on, etc. will help.


Since you asked :-)


~$ sudo perl -MCPAN -e shell
Password:

cpan shell -- CPAN exploration and modules installation (v1.7601)
ReadLine support enabled

 
          cpan> install W3C::LogValidator
CPAN: Storable loaded ok
Going to read /Users/elharo/.cpan/Metadata
   Database was generated on Tue, 30 Jan 2007 16:27:34 GMT
LWP not available
CPAN: Net::FTP loaded ok
Fetching with Net::FTP:
   ftp://carroll.cac.psu.edu/pub/CPAN/authors/01mailrc.txt.gz
LWP not available
Fetching with Net::FTP:
   ftp://cpan.uchicago.edu/pub/CPAN/authors/01mailrc.txt.gz
Couldn't fetch 01mailrc.txt.gz from cpan.uchicago.edu
LWP not available
Fetching with Net::FTP:
   ftp://cpan.mirrors.redwire.net/pub/CPAN/authors/01mailrc.txt.gz
Couldn't fetch 01mailrc.txt.gz from cpan.mirrors.redwire.net
LWP not available
Fetching with Net::FTP:
   ftp://cpan.cs.utah.edu/pub/CPAN/authors/01mailrc.txt.gz
Couldn't fetch 01mailrc.txt.gz from cpan.cs.utah.edu
LWP not available
Fetching with Net::FTP:
   ftp://cpan.cse.msu.edu/authors/01mailrc.txt.gz
Couldn't fetch 01mailrc.txt.gz from cpan.cse.msu.edu
Issuing "/usr/bin/ftp -n"
Connected to carroll.aset.psu.edu.
220-
220-                             Welcome to
220-                The Pennsylvania State University /
220-             Academic Services and Emerging Technologies
220-                FTP Archives at carroll.aset.psu.edu
220-
220-This site is provided as a public service by the Pennsylvania State
220-University.  Use in violation of any applicable laws is strictly
220-prohibited.  We make no guarantees, explicit or implicit, about the
220-contents of this site.  Use at your own risk.
220-
220-Due to U.S. Exports Regulations, all cryptographic software on this
220-site is subject to the following legal notice:
220-
220-    This site includes publicly available encryption source code
220-    which, together with object code resulting from the compiling of
220-    publicly available source code, may be exported from the United
220-    States under License Exception "TSU" pursuant to 15 C.F.R. Section
220-    740.13(e).
220-
220-This legal notice applies to cryptographic software only.  Please see
220-the Bureau of Export Administration (http://www.bxa.doc.gov/) for more
220-information about current U.S. regulations.
220-
220-This archive is accessible via the following protocols:
220-
220-    ftp://carroll.aset.psu.edu
220-    http://carroll.aset.psu.edu
220-    rsync://carroll.aset.psu.edu
220-
220-Please send suggestions/comments to ftp@carroll.aset.psu.edu.
220-
220
331 Please specify the password.
230 Login successful.
Remote system type is UNIX.
Using binary mode to transfer files.
Local directory now /Users/elharo/.cpan/sources/authors
250 Directory successfully changed.
250 Directory successfully changed.
250-The Comprehensive Perl Archive Network (http://www.cpan.org/)
250-master site has been from the very beginning (1995) hosted at FUNET,
250-the Finnish University NETwork.
250-
250-
250 Directory successfully changed.
250 Directory successfully changed.
200 Switching to Binary mode.
local: 01mailrc.txt.gz remote: 01mailrc.txt.gz
229 Entering Extended Passive Mode (|||16462|)
150 Opening BINARY mode data connection for 01mailrc.txt.gz (126790 bytes).
100% |*************************************|   123 KB  345.43 KB/s 
00:00
226 File send OK.
126790 bytes received in 00:00 (344.98 KB/s)
221 Goodbye.
GOT /Users/elharo/.cpan/sources/authors/01mailrc.txt.gz
Going to read /Users/elharo/.cpan/sources/authors/01mailrc.txt.gz
CPAN: Compress::Zlib loaded ok
Issuing "/usr/bin/ftp -n"
Connected to carroll.aset.psu.edu.
220-
220-                             Welcome to
220-                The Pennsylvania State University /
220-             Academic Services and Emerging Technologies
220-                FTP Archives at carroll.aset.psu.edu
220-
220-This site is provided as a public service by the Pennsylvania State
220-University.  Use in violation of any applicable laws is strictly
220-prohibited.  We make no guarantees, explicit or implicit, about the
220-contents of this site.  Use at your own risk.
220-
220-Due to U.S. Exports Regulations, all cryptographic software on this
220-site is subject to the following legal notice:
220-
220-    This site includes publicly available encryption source code
220-    which, together with object code resulting from the compiling of
220-    publicly available source code, may be exported from the United
220-    States under License Exception "TSU" pursuant to 15 C.F.R. Section
220-    740.13(e).
220-
220-This legal notice applies to cryptographic software only.  Please see
220-the Bureau of Export Administration (http://www.bxa.doc.gov/) for more
220-information about current U.S. regulations.
220-
220-This archive is accessible via the following protocols:
220-
220-    ftp://carroll.aset.psu.edu
220-    http://carroll.aset.psu.edu
220-    rsync://carroll.aset.psu.edu
220-
220-Please send suggestions/comments to ftp@carroll.aset.psu.edu.
220-
220
331 Please specify the password.
230 Login successful.
Remote system type is UNIX.
Using binary mode to transfer files.
Local directory now /Users/elharo/.cpan/sources/modules
250 Directory successfully changed.
250 Directory successfully changed.
250-The Comprehensive Perl Archive Network (http://www.cpan.org/)
250-master site has been from the very beginning (1995) hosted at FUNET,
250-the Finnish University NETwork.
250-
250-
250 Directory successfully changed.
250 Directory successfully changed.
200 Switching to Binary mode.
local: 02packages.details.txt.gz remote: 02packages.details.txt.gz
229 Entering Extended Passive Mode (|||55312|)
150 Opening BINARY mode data connection for 02packages.details.txt.gz 
(517197 bytes).
100% |*************************************|   505 KB  243.56 KB/s 
00:02
226 File send OK.
517197 bytes received in 00:02 (243.49 KB/s)
221 Goodbye.
GOT /Users/elharo/.cpan/sources/modules/02packages.details.txt.gz
Going to read /Users/elharo/.cpan/sources/modules/02packages.details.txt.gz
   Database was generated on Thu, 01 Feb 2007 15:27:30 GMT
   HTTP::Date not available

   There's a new CPAN.pm version (v1.8802) available!
   [Current version is v1.7601]
   You might want to try
     install Bundle::CPAN
     reload cpan
   without quitting the current session. It should be a seamless upgrade
   while we are running...

Issuing "/usr/bin/ftp -n"
Connected to carroll.aset.psu.edu.
220-
220-                             Welcome to
220-                The Pennsylvania State University /
220-             Academic Services and Emerging Technologies
220-                FTP Archives at carroll.aset.psu.edu
220-
220-This site is provided as a public service by the Pennsylvania State
220-University.  Use in violation of any applicable laws is strictly
220-prohibited.  We make no guarantees, explicit or implicit, about the
220-contents of this site.  Use at your own risk.
220-
220-Due to U.S. Exports Regulations, all cryptographic software on this
220-site is subject to the following legal notice:
220-
220-    This site includes publicly available encryption source code
220-    which, together with object code resulting from the compiling of
220-    publicly available source code, may be exported from the United
220-    States under License Exception "TSU" pursuant to 15 C.F.R. Section
220-    740.13(e).
220-
220-This legal notice applies to cryptographic software only.  Please see
220-the Bureau of Export Administration (http://www.bxa.doc.gov/) for more
220-information about current U.S. regulations.
220-
220-This archive is accessible via the following protocols:
220-
220-    ftp://carroll.aset.psu.edu
220-    http://carroll.aset.psu.edu
220-    rsync://carroll.aset.psu.edu
220-
220-Please send suggestions/comments to ftp@carroll.aset.psu.edu.
220-
220
331 Please specify the password.
230 Login successful.
Remote system type is UNIX.
Using binary mode to transfer files.
Local directory now /Users/elharo/.cpan/sources/modules
250 Directory successfully changed.
250 Directory successfully changed.
250-The Comprehensive Perl Archive Network (http://www.cpan.org/)
250-master site has been from the very beginning (1995) hosted at FUNET,
250-the Finnish University NETwork.
250-
250-
250 Directory successfully changed.
250 Directory successfully changed.
200 Switching to Binary mode.
local: 03modlist.data.gz remote: 03modlist.data.gz
229 Entering Extended Passive Mode (|||10375|)
150 Opening BINARY mode data connection for 03modlist.data.gz (129183 
bytes).
100% |*************************************|   126 KB  354.10 KB/s 
00:00
226 File send OK.
129183 bytes received in 00:00 (353.53 KB/s)
221 Goodbye.
GOT /Users/elharo/.cpan/sources/modules/03modlist.data.gz
Going to read /Users/elharo/.cpan/sources/modules/03modlist.data.gz
Going to write /Users/elharo/.cpan/Metadata
Running install for module W3C::LogValidator
Running make for O/OL/OLIVIERT/LogValidator/W3C-LogValidator-1.06.tar.gz
CPAN: Digest::MD5 loaded ok
Checksum for 
/Users/elharo/.cpan/sources/authors/id/O/OL/OLIVIERT/LogValidator/W3C-LogValidator-1.06.tar.gz 
ok
Scanning cache /Users/elharo/.cpan/build for sizes
Deleting from cache: /Users/elharo/.cpan/build/XML-Parser-2.34 
(17.3>10.0 MB)
Deleting from cache: /Users/elharo/.cpan/build/Bundle-CPAN-1.855 
(16.7>10.0 MB)
Deleting from cache: /Users/elharo/.cpan/build/SOAP-Lite-0.69 (16.7>10.0 MB)
Deleting from cache: /Users/elharo/.cpan/build/libwww-perl-5.805 
(14.8>10.0 MB)
Deleting from cache: /Users/elharo/.cpan/build/Class-Accessor-0.30 
(13.1>10.0 MB)
Deleting from cache: 
/Users/elharo/.cpan/build/WebService-Validator-CSS-W3C-0.2 (13.0>10.0 MB)
Deleting from cache: /Users/elharo/.cpan/build/Mail-Sendmail-0.79 
(13.0>10.0 MB)
Deleting from cache: /Users/elharo/.cpan/build/Config-General-2.31 
(12.8>10.0 MB)
Deleting from cache: /Users/elharo/.cpan/build/W3C-LogValidator-1.06 
(12.5>10.0 MB)
Deleting from cache: /Users/elharo/.cpan/build/Test-Harness-2.64 
(12.2>10.0 MB)
Deleting from cache: /Users/elharo/.cpan/build/ExtUtils-CBuilder-0.18 
(11.8>10.0 MB)
Deleting from cache: /Users/elharo/.cpan/build/Module-Build-0.2806 
(11.6>10.0 MB)
Deleting from cache: /Users/elharo/.cpan/build/PathTools-3.24 (10.5>10.0 MB)
W3C-LogValidator-1.06/
W3C-LogValidator-1.06/Changes
W3C-LogValidator-1.06/MANIFEST
W3C-LogValidator-1.06/META.yml
W3C-LogValidator-1.06/Makefile.PL
W3C-LogValidator-1.06/README
W3C-LogValidator-1.06/bin/
W3C-LogValidator-1.06/bin/logprocess.pl
W3C-LogValidator-1.06/lib/
W3C-LogValidator-1.06/lib/W3C/
W3C-LogValidator-1.06/lib/W3C/LogValidator/
W3C-LogValidator-1.06/lib/W3C/LogValidator/Basic.pm
W3C-LogValidator-1.06/lib/W3C/LogValidator/CSSValidator.pm
W3C-LogValidator-1.06/lib/W3C/LogValidator/Config.pm
W3C-LogValidator-1.06/lib/W3C/LogValidator/HTMLValidator.pm
W3C-LogValidator-1.06/lib/W3C/LogValidator/LinkChecker.pm
W3C-LogValidator-1.06/lib/W3C/LogValidator/LinkReferer.pm
W3C-LogValidator-1.06/lib/W3C/LogValidator/Output/
W3C-LogValidator-1.06/lib/W3C/LogValidator/Output/HTML.pm
W3C-LogValidator-1.06/lib/W3C/LogValidator/Output/Mail.pm
W3C-LogValidator-1.06/lib/W3C/LogValidator/Output/Raw.pm
W3C-LogValidator-1.06/lib/W3C/LogValidator/SurveyEngine.pm
W3C-LogValidator-1.06/lib/W3C/LogValidator.pm
W3C-LogValidator-1.06/samples/
W3C-LogValidator-1.06/samples/NewModule.pm
W3C-LogValidator-1.06/samples/NewOutputModule.pm
W3C-LogValidator-1.06/samples/logprocess.conf
W3C-LogValidator-1.06/t/
W3C-LogValidator-1.06/t/base.t
W3C-LogValidator-1.06/t/module-basic.t
W3C-LogValidator-1.06/t/module-css.t
W3C-LogValidator-1.06/t/module-htmlval.t
W3C-LogValidator-1.06/t/module-linkcheck.t
W3C-LogValidator-1.06/t/module-survey.t

   CPAN.pm: Going to build 
O/OL/OLIVIERT/LogValidator/W3C-LogValidator-1.06.tar.gz

Checking if your kit is complete...
Looks good
Warning: prerequisite Config::General 0 not found.
Warning: prerequisite LWP::UserAgent 0 not found.
Warning: prerequisite Mail::Sendmail 0 not found.
Warning: prerequisite WebService::Validator::CSS::W3C 0 not found.
Writing Makefile for W3C::LogValidator
---- Unsatisfied dependencies detected during 
[O/OL/OLIVIERT/LogValidator/W3C-LogValidator-1.06.tar.gz] -----
     WebService::Validator::CSS::W3C
     LWP::UserAgent
     Mail::Sendmail
     Config::General
Shall I follow them and prepend them to the queue
of modules we are processing right now? [yes]
Running make test
   Delayed until after prerequisites
Running make install
   Delayed until after prerequisites
Running install for module WebService::Validator::CSS::W3C
Running make for 
O/OL/OLIVIERT/WebService/WebService-Validator-CSS-W3C-0.2.tar.gz
Checksum for 
/Users/elharo/.cpan/sources/authors/id/O/OL/OLIVIERT/WebService/WebService-Validator-CSS-W3C-0.2.tar.gz 
ok
WebService-Validator-CSS-W3C-0.2/Changes
WebService-Validator-CSS-W3C-0.2/lib/WebService/Validator/CSS/W3C.pm
WebService-Validator-CSS-W3C-0.2/Makefile.PL
WebService-Validator-CSS-W3C-0.2/t
WebService-Validator-CSS-W3C-0.2/t/WebService-Validator-CSS-W3C.t
WebService-Validator-CSS-W3C-0.2/META.yml
WebService-Validator-CSS-W3C-0.2
WebService-Validator-CSS-W3C-0.2/README
/sw/bin/tar: Read 4608 bytes from -
WebService-Validator-CSS-W3C-0.2/lib/WebService
WebService-Validator-CSS-W3C-0.2/lib
WebService-Validator-CSS-W3C-0.2/lib/WebService/Validator
WebService-Validator-CSS-W3C-0.2/MANIFEST
WebService-Validator-CSS-W3C-0.2/lib/WebService/Validator/CSS

   CPAN.pm: Going to build 
O/OL/OLIVIERT/WebService/WebService-Validator-CSS-W3C-0.2.tar.gz

Checking if your kit is complete...
Looks good
Warning: prerequisite Class::Accessor 0 not found.
Warning: prerequisite LWP::UserAgent 0 not found.
Warning: prerequisite SOAP::Lite 0.65 not found.
Writing Makefile for WebService::Validator::CSS::W3C
---- Unsatisfied dependencies detected during 
[O/OL/OLIVIERT/WebService/WebService-Validator-CSS-W3C-0.2.tar.gz] -----
     SOAP::Lite
     LWP::UserAgent
     Class::Accessor
Shall I follow them and prepend them to the queue
of modules we are processing right now? [yes]
Running make test
   Delayed until after prerequisites
Running make install
   Delayed until after prerequisites
Running install for module SOAP::Lite
Running make for B/BY/BYRNE/SOAP-Lite-0.69.tar.gz
Checksum for 
/Users/elharo/.cpan/sources/authors/id/B/BY/BYRNE/SOAP-Lite-0.69.tar.gz ok
SOAP-Lite-0.69/
SOAP-Lite-0.69/lib/
SOAP-Lite-0.69/lib/XMLRPC/
SOAP-Lite-0.69/lib/XMLRPC/Transport/
SOAP-Lite-0.69/lib/XMLRPC/Transport/TCP.pm
SOAP-Lite-0.69/lib/XMLRPC/Transport/POP3.pm
SOAP-Lite-0.69/lib/XMLRPC/Transport/HTTP.pm
SOAP-Lite-0.69/lib/XMLRPC/Lite.pm
SOAP-Lite-0.69/lib/XMLRPC/Test.pm
SOAP-Lite-0.69/lib/SOAP/
SOAP-Lite-0.69/lib/SOAP/Transport/
SOAP-Lite-0.69/lib/SOAP/Transport/JABBER.pm
SOAP-Lite-0.69/lib/SOAP/Transport/MAILTO.pm
SOAP-Lite-0.69/lib/SOAP/Transport/HTTP.pm
SOAP-Lite-0.69/lib/SOAP/Transport/LOCAL.pm
SOAP-Lite-0.69/lib/SOAP/Transport/POP3.pm
SOAP-Lite-0.69/lib/SOAP/Transport/FTP.pm
SOAP-Lite-0.69/lib/SOAP/Transport/MQ.pm
SOAP-Lite-0.69/lib/SOAP/Transport/IO.pm
SOAP-Lite-0.69/lib/SOAP/Transport/TCP.pm
SOAP-Lite-0.69/lib/SOAP/Lite.pm
SOAP-Lite-0.69/lib/SOAP/Data.pm
SOAP-Lite-0.69/lib/SOAP/Test.pm
SOAP-Lite-0.69/lib/SOAP/Schema.pm
SOAP-Lite-0.69/lib/SOAP/Server.pm
SOAP-Lite-0.69/lib/SOAP/Utils.pm
SOAP-Lite-0.69/lib/SOAP/Client.pm
SOAP-Lite-0.69/lib/SOAP/Fault.pm
SOAP-Lite-0.69/lib/SOAP/Transport.pm
SOAP-Lite-0.69/lib/SOAP/Header.pm
SOAP-Lite-0.69/lib/SOAP/Packager.pm
SOAP-Lite-0.69/lib/SOAP/Deserializer.pm
SOAP-Lite-0.69/lib/SOAP/Trace.pm
SOAP-Lite-0.69/lib/SOAP/Constants.pm
SOAP-Lite-0.69/lib/SOAP/Serializer.pm
SOAP-Lite-0.69/lib/SOAP/SOM.pm
SOAP-Lite-0.69/lib/Apache/
SOAP-Lite-0.69/lib/Apache/SOAP.pm
SOAP-Lite-0.69/lib/Apache/XMLRPC/
SOAP-Lite-0.69/lib/Apache/XMLRPC/Lite.pm
SOAP-Lite-0.69/lib/OldDocs/
SOAP-Lite-0.69/lib/OldDocs/SOAP/
SOAP-Lite-0.69/lib/OldDocs/SOAP/Transport/
SOAP-Lite-0.69/lib/OldDocs/SOAP/Transport/HTTP.pm
SOAP-Lite-0.69/lib/OldDocs/SOAP/Transport/FTP.pm
SOAP-Lite-0.69/lib/OldDocs/SOAP/Transport/JABBER.pm
SOAP-Lite-0.69/lib/OldDocs/SOAP/Transport/IO.pm
SOAP-Lite-0.69/lib/OldDocs/SOAP/Transport/MQ.pm
SOAP-Lite-0.69/lib/OldDocs/SOAP/Transport/LOCAL.pm
SOAP-Lite-0.69/lib/OldDocs/SOAP/Transport/TCP.pm
SOAP-Lite-0.69/lib/OldDocs/SOAP/Transport/POP3.pm
SOAP-Lite-0.69/lib/OldDocs/SOAP/Transport/MAILTO.pm
SOAP-Lite-0.69/lib/OldDocs/SOAP/Lite.pm
SOAP-Lite-0.69/lib/IO/
SOAP-Lite-0.69/lib/IO/SessionSet.pm
SOAP-Lite-0.69/lib/IO/SessionData.pm
SOAP-Lite-0.69/lib/XML/
SOAP-Lite-0.69/lib/XML/Parser/
SOAP-Lite-0.69/lib/XML/Parser/Lite.pm
SOAP-Lite-0.69/lib/UDDI/
SOAP-Lite-0.69/lib/UDDI/Lite.pm
SOAP-Lite-0.69/Changes
SOAP-Lite-0.69/examples/
SOAP-Lite-0.69/examples/XMLRPC/
SOAP-Lite-0.69/examples/XMLRPC/xmlrpc.cgi
SOAP-Lite-0.69/examples/XMLRPC/simple1.pl
SOAP-Lite-0.69/examples/XMLRPC/xmlrpc.daemon
SOAP-Lite-0.69/examples/XMLRPC/mod_xmlrpc.htaccess
SOAP-Lite-0.69/examples/server/
SOAP-Lite-0.69/examples/server/soap.cgi
SOAP-Lite-0.69/examples/server/soap.mod_cgi
SOAP-Lite-0.69/examples/server/soap.daemon.forkafterprocessing
SOAP-Lite-0.69/examples/server/soap.daemon.forkonaccept
SOAP-Lite-0.69/examples/server/soap.io
SOAP-Lite-0.69/examples/server/soap.tcp
SOAP-Lite-0.69/examples/server/soap.pop3
SOAP-Lite-0.69/examples/server/soap.asp
SOAP-Lite-0.69/examples/server/soap_perl.asp
SOAP-Lite-0.69/examples/server/soap.fcgi
SOAP-Lite-0.69/examples/server/soap.daemon
SOAP-Lite-0.69/examples/server/soap.jabber
SOAP-Lite-0.69/examples/server/mod_soap.htaccess
SOAP-Lite-0.69/examples/server/soap.vbs
SOAP-Lite-0.69/examples/server/soap.mq
SOAP-Lite-0.69/examples/server/Apache.pm
SOAP-Lite-0.69/examples/chat.pl
SOAP-Lite-0.69/examples/UDDI/
SOAP-Lite-0.69/examples/UDDI/syntax2.pl
SOAP-Lite-0.69/examples/UDDI/simple1.pl
SOAP-Lite-0.69/examples/UDDI/syntax1.pl
SOAP-Lite-0.69/examples/UDDI/inquire1.pl
SOAP-Lite-0.69/examples/UDDI/simple2.pl
SOAP-Lite-0.69/examples/UDDI/publish1.pl
SOAP-Lite-0.69/examples/UDDI/syntax3.pl
SOAP-Lite-0.69/examples/My/
SOAP-Lite-0.69/examples/My/SessionIterator.pm
SOAP-Lite-0.69/examples/My/PingPong.pm
SOAP-Lite-0.69/examples/My/Examples.pm
SOAP-Lite-0.69/examples/My/PersistentIterator.pm
SOAP-Lite-0.69/examples/My/Chat.pm
SOAP-Lite-0.69/examples/My/Parameters.pm
SOAP-Lite-0.69/examples/oneliners
SOAP-Lite-0.69/examples/customschema.pl
SOAP-Lite-0.69/examples/JABBER/
SOAP-Lite-0.69/examples/JABBER/jabclient.pl
SOAP-Lite-0.69/examples/JABBER/jabserver.pl
SOAP-Lite-0.69/examples/iterator.pl
SOAP-Lite-0.69/examples/COM/
SOAP-Lite-0.69/examples/COM/SOAP-Lite-COM-standalone.ctrl
SOAP-Lite-0.69/examples/COM/states.vbs
SOAP-Lite-0.69/examples/COM/soap.asp
SOAP-Lite-0.69/examples/COM/remote.vba
SOAP-Lite-0.69/examples/COM/soap.vbs
SOAP-Lite-0.69/examples/COM/xmlrpc.vbs
SOAP-Lite-0.69/examples/COM/local.vbs
SOAP-Lite-0.69/examples/COM/SOAP-Lite-COM-minimal.ctrl
SOAP-Lite-0.69/examples/COM/remote.cs
SOAP-Lite-0.69/examples/COM/hashecho.vbs
SOAP-Lite-0.69/examples/COM/soap_perl.asp
SOAP-Lite-0.69/examples/COM/states.html
SOAP-Lite-0.69/examples/COM/temper.vbs
SOAP-Lite-0.69/examples/COM/service.vbs
SOAP-Lite-0.69/examples/COM/remote.xls
SOAP-Lite-0.69/examples/COM/remote.vbs
SOAP-Lite-0.69/examples/COM/states.pl
SOAP-Lite-0.69/examples/COM/states.vba
SOAP-Lite-0.69/examples/COM/make-com-standalone.bat
SOAP-Lite-0.69/examples/COM/README
SOAP-Lite-0.69/examples/COM/hash.vbs
SOAP-Lite-0.69/examples/COM/states.xls
SOAP-Lite-0.69/examples/COM/make-com-minimal.bat
SOAP-Lite-0.69/examples/pingpong.pl
SOAP-Lite-0.69/examples/inline.daemon
SOAP-Lite-0.69/examples/joke.pl
SOAP-Lite-0.69/examples/soapmark.pl
SOAP-Lite-0.69/examples/SOAP/
SOAP-Lite-0.69/examples/SOAP/simple2.pl
SOAP-Lite-0.69/examples/SOAP/simple1.pl
SOAP-Lite-0.69/examples/SOAP/simple3.pl
SOAP-Lite-0.69/examples/SOAP/Transport/
SOAP-Lite-0.69/examples/SOAP/Transport/HTTP/
SOAP-Lite-0.69/examples/SOAP/Transport/HTTP/Daemon/
SOAP-Lite-0.69/examples/SOAP/Transport/HTTP/Daemon/ForkOnAccept.pm
SOAP-Lite-0.69/examples/SOAP/Transport/HTTP/Daemon/ForkAfterProcessing.pm
SOAP-Lite-0.69/examples/forms/
SOAP-Lite-0.69/examples/forms/style.html
SOAP-Lite-0.69/examples/forms/style.cgi
SOAP-Lite-0.69/examples/compress.pl
SOAP-Lite-0.69/examples/WSDL/
SOAP-Lite-0.69/examples/WSDL/dynamic3.pl
SOAP-Lite-0.69/examples/WSDL/dynamic2.pl
SOAP-Lite-0.69/examples/WSDL/stub2.pl
SOAP-Lite-0.69/examples/WSDL/stub3.pl
SOAP-Lite-0.69/examples/WSDL/dynamic1.pl
SOAP-Lite-0.69/examples/WSDL/dynamic4.pl
SOAP-Lite-0.69/examples/WSDL/stub1.pl
SOAP-Lite-0.69/examples/terraserver.pl
SOAP-Lite-0.69/examples/cookie.pl
SOAP-Lite-0.69/examples/tcpclient.pl
SOAP-Lite-0.69/examples/cookieauth.pl
SOAP-Lite-0.69/examples/XML/
SOAP-Lite-0.69/examples/XML/customxml.pl
SOAP-Lite-0.69/examples/oo-apache.pl
SOAP-Lite-0.69/examples/weblog.pl
SOAP-Lite-0.69/examples/authentication.pl
SOAP-Lite-0.69/examples/parametersbyname.pl
SOAP-Lite-0.69/examples/soapsmtp.pl
SOAP-Lite-0.69/examples/getdom.pl
SOAP-Lite-0.69/examples/MQ/
SOAP-Lite-0.69/examples/MQ/mqserver.pl
SOAP-Lite-0.69/examples/MQ/mqclient.pl
SOAP-Lite-0.69/examples/autoexamples.pl
SOAP-Lite-0.69/examples/allclients.pl
SOAP-Lite-0.69/examples/google.pl
SOAP-Lite-0.69/examples/fullsearch.pl
SOAP-Lite-0.69/bin/
SOAP-Lite-0.69/bin/stubmaker.pl
SOAP-Lite-0.69/bin/XMLRPCsh.pl
SOAP-Lite-0.69/bin/SOAPsh.pl
SOAP-Lite-0.69/t/
SOAP-Lite-0.69/t/22-interop_apache.t
SOAP-Lite-0.69/t/28-uddi_search.t
SOAP-Lite-0.69/t/38-packager.t
SOAP-Lite-0.69/t/06-modules.t
SOAP-Lite-0.69/t/04-attach.t
SOAP-Lite-0.69/t/15-daemon.t
SOAP-Lite-0.69/t/08-schema.t
SOAP-Lite-0.69/t/14-cgi_apache.t
SOAP-Lite-0.69/t/27-xmlparserlite.t
SOAP-Lite-0.69/t/25-uddi.t
SOAP-Lite-0.69/t/23-ppm.t
SOAP-Lite-0.69/t/02-payload.t
SOAP-Lite-0.69/t/21-public.t
SOAP-Lite-0.69/t/36-leaks.t
SOAP-Lite-0.69/t/05-customxml.t
SOAP-Lite-0.69/t/29-uddi_publishing.t
SOAP-Lite-0.69/t/01-core.t
SOAP-Lite-0.69/t/07-xmlrpc_payload.t
SOAP-Lite-0.69/t/26-xmlrpc.t
SOAP-Lite-0.69/t/03-server.t
SOAP-Lite-0.69/t/24-wsdl.t
SOAP-Lite-0.69/t/19-apachesoap.t
SOAP-Lite-0.69/t/11-cgi.t
SOAP-Lite-0.69/t/37-mod_xmlrpc.t
SOAP-Lite-0.69/t/16-tcp.t
SOAP-Lite-0.69/t/12-cgi_https.t
SOAP-Lite-0.69/t/TEST.pl
SOAP-Lite-0.69/t/17-mod_soap.t
SOAP-Lite-0.69/t/13-mod_perl.t
SOAP-Lite-0.69/ReleaseNotes.txt
SOAP-Lite-0.69/README
SOAP-Lite-0.69/META.yml
SOAP-Lite-0.69/Makefile.PL
SOAP-Lite-0.69/MANIFEST

   CPAN.pm: Going to build B/BY/BYRNE/SOAP-Lite-0.69.tar.gz

We are about to install SOAP::Lite and for your convenience will provide
you with list of modules and prerequisites, so you'll be able to choose
only modules you need for your configuration.

XMLRPC::Lite, UDDI::Lite, and XML::Parser::Lite are included by default.
Installed transports can be used for both SOAP::Lite and XMLRPC::Lite.

Press <enter> to see the detailed list.

Feature                       Prerequisites                Install?
----------------------------- ---------------------------- --------
Core Package                  [*] URI                      always
                               [*] MIME::Base64
                               [ ] XML::Parser (v2.23)
Client HTTP support           [ ] LWP::UserAgent           [ yes ]
Client HTTPS support          [ ] Crypt::SSLeay            [ no ]
Client SMTP/sendmail support  [ ] MIME::Lite               [ no ]
Client FTP support            [*] IO::File                 [ yes ]
                               [*] Net::FTP
Standalone HTTP server        [ ] HTTP::Daemon             [ no ]
Apache/mod_perl server        [*] Apache                   [ yes ]
FastCGI server                [ ] FCGI                     [ no ]
POP3 server                   [*] MIME::Parser             [ yes ]
                               [*] Net::POP3
IO server                     [*] IO::File                 [ yes ]
MQ transport support          [ ] MQSeries                 [ no ]
JABBER transport support      [ ] Net::Jabber              [ no ]
MIME messages                 [*] MIME::Parser             [ yes ]
DIME messages                 [*] IO::Scalar (v2.105)      [ no ]
                               [ ] DIME::Tools (v0.03)
                               [ ] Data::UUID (v0.11)
SSL Support for TCP Transport [ ] IO::Socket::SSL          [ no ]
Compression support for HTTP  [*] Compress::Zlib           [ yes ]
MIME interoperability w/ Axis [ ] MIME::Parser (v6.106)    [ no ]
--- An asterix '[*]' indicates if the module is currently installed.

Do you want to proceed with this configuration? [yes]

During "make test" phase we may run tests with several SOAP servers
that may take long and may fail due to server/connectivity problems.

Do you want to perform these tests in addition to core tests? [no]
Checking if your kit is complete...
Looks good
Warning: prerequisite XML::Parser 2.23 not found.
Writing Makefile for SOAP::Lite
---- Unsatisfied dependencies detected during 
[B/BY/BYRNE/SOAP-Lite-0.69.tar.gz] -----
     XML::Parser
Shall I follow them and prepend them to the queue
of modules we are processing right now? [yes]
Running make test
   Delayed until after prerequisites
Running make install
   Delayed until after prerequisites
Running install for module XML::Parser
Running make for M/MS/MSERGEANT/XML-Parser-2.34.tar.gz
Checksum for 
/Users/elharo/.cpan/sources/authors/id/M/MS/MSERGEANT/XML-Parser-2.34.tar.gz 
ok
XML-Parser-2.34
XML-Parser-2.34/Changes
XML-Parser-2.34/Expat
XML-Parser-2.34/Expat/encoding.h
XML-Parser-2.34/Expat/Expat.pm
XML-Parser-2.34/Expat/Expat.xs
XML-Parser-2.34/Expat/Makefile.PL
XML-Parser-2.34/Expat/typemap
XML-Parser-2.34/Makefile.PL
XML-Parser-2.34/MANIFEST
XML-Parser-2.34/Parser
XML-Parser-2.34/Parser/Encodings
XML-Parser-2.34/Parser/Encodings/big5.enc
XML-Parser-2.34/Parser/Encodings/euc-kr.enc
XML-Parser-2.34/Parser/Encodings/iso-8859-2.enc
XML-Parser-2.34/Parser/Encodings/iso-8859-3.enc
XML-Parser-2.34/Parser/Encodings/iso-8859-4.enc
XML-Parser-2.34/Parser/Encodings/iso-8859-5.enc
XML-Parser-2.34/Parser/Encodings/iso-8859-7.enc
XML-Parser-2.34/Parser/Encodings/iso-8859-8.enc
XML-Parser-2.34/Parser/Encodings/iso-8859-9.enc
XML-Parser-2.34/Parser/Encodings/Japanese_Encodings.msg
XML-Parser-2.34/Parser/Encodings/README
XML-Parser-2.34/Parser/Encodings/windows-1250.enc
XML-Parser-2.34/Parser/Encodings/windows-1252.enc
XML-Parser-2.34/Parser/Encodings/x-euc-jp-jisx0221.enc
XML-Parser-2.34/Parser/Encodings/x-euc-jp-unicode.enc
XML-Parser-2.34/Parser/Encodings/x-sjis-cp932.enc
XML-Parser-2.34/Parser/Encodings/x-sjis-jdk117.enc
XML-Parser-2.34/Parser/Encodings/x-sjis-jisx0221.enc
XML-Parser-2.34/Parser/Encodings/x-sjis-unicode.enc
XML-Parser-2.34/Parser/LWPExternEnt.pl
XML-Parser-2.34/Parser/Style
XML-Parser-2.34/Parser/Style/Debug.pm
XML-Parser-2.34/Parser/Style/Objects.pm
XML-Parser-2.34/Parser/Style/Stream.pm
XML-Parser-2.34/Parser/Style/Subs.pm
XML-Parser-2.34/Parser/Style/Tree.pm
XML-Parser-2.34/Parser.pm
XML-Parser-2.34/README
XML-Parser-2.34/samples
XML-Parser-2.34/samples/canonical
XML-Parser-2.34/samples/canontst.xml
XML-Parser-2.34/samples/ctest.dtd
XML-Parser-2.34/samples/REC-xml-19980210.xml
XML-Parser-2.34/samples/xmlcomments
XML-Parser-2.34/samples/xmlfilter
XML-Parser-2.34/samples/xmlstats
XML-Parser-2.34/t
XML-Parser-2.34/t/astress.t
XML-Parser-2.34/t/cdata.t
XML-Parser-2.34/t/decl.t
XML-Parser-2.34/t/defaulted.t
XML-Parser-2.34/t/encoding.t
XML-Parser-2.34/t/ext.ent
XML-Parser-2.34/t/ext2.ent
XML-Parser-2.34/t/external_ent.t
XML-Parser-2.34/t/file.t
XML-Parser-2.34/t/finish.t
XML-Parser-2.34/t/foo.dtd
XML-Parser-2.34/t/namespaces.t
XML-Parser-2.34/t/parament.t
XML-Parser-2.34/t/partial.t
XML-Parser-2.34/t/skip.t
XML-Parser-2.34/t/stream.t
XML-Parser-2.34/t/styles.t

   CPAN.pm: Going to build M/MS/MSERGEANT/XML-Parser-2.34.tar.gz

Note (probably harmless): No library found for -lexpat

Expat must be installed prior to building XML::Parser and I can't find
it in the standard library directories. You can download expat from:

http://sourceforge.net/projects/expat/

If expat is installed, but in a non-standard directory, then use the
following options to Makefile.PL:

     EXPATLIBPATH=...  To set the directory in which to find libexpat

     EXPATINCPATH=...  To set the directory in which to find expat.h

For example:

     perl Makefile.PL EXPATLIBPATH=/home/me/lib 
EXPATINCPATH=/home/me/include

Note that if you build against a shareable library in a non-standard 
location
you may (on some platforms) also have to set your LD_LIBRARY_PATH 
environment
variable at run time for perl to find the library.

Running make test
   Make had some problems, maybe interrupted? Won't test
Running make install
   Make had some problems, maybe interrupted? Won't install
Running make for B/BY/BYRNE/SOAP-Lite-0.69.tar.gz
   Is already unwrapped into directory 
/Users/elharo/.cpan/build/SOAP-Lite-0.69

   CPAN.pm: Going to build B/BY/BYRNE/SOAP-Lite-0.69.tar.gz

cp lib/SOAP/Packager.pm blib/lib/SOAP/Packager.pm
cp lib/SOAP/Data.pm blib/lib/SOAP/Data.pm
cp lib/XML/Parser/Lite.pm blib/lib/XML/Parser/Lite.pm
cp lib/XMLRPC/Transport/TCP.pm blib/lib/XMLRPC/Transport/TCP.pm
cp lib/SOAP/Transport/JABBER.pm blib/lib/SOAP/Transport/JABBER.pm
cp lib/OldDocs/SOAP/Transport/TCP.pm blib/lib/OldDocs/SOAP/Transport/TCP.pm
cp lib/SOAP/Transport/MAILTO.pm blib/lib/SOAP/Transport/MAILTO.pm
cp lib/OldDocs/SOAP/Transport/POP3.pm 
blib/lib/OldDocs/SOAP/Transport/POP3.pm
cp lib/Apache/SOAP.pm blib/lib/Apache/SOAP.pm
cp lib/SOAP/Test.pm blib/lib/SOAP/Test.pm
cp lib/SOAP/Transport.pm blib/lib/SOAP/Transport.pm
cp lib/Apache/XMLRPC/Lite.pm blib/lib/Apache/XMLRPC/Lite.pm
cp lib/XMLRPC/Transport/HTTP.pm blib/lib/XMLRPC/Transport/HTTP.pm
cp lib/SOAP/Transport/MQ.pm blib/lib/SOAP/Transport/MQ.pm
cp lib/SOAP/Transport/POP3.pm blib/lib/SOAP/Transport/POP3.pm
cp lib/SOAP/Deserializer.pm blib/lib/SOAP/Deserializer.pm
cp lib/SOAP/Trace.pm blib/lib/SOAP/Trace.pm
cp lib/SOAP/Schema.pm blib/lib/SOAP/Schema.pm
cp lib/SOAP/Transport/IO.pm blib/lib/SOAP/Transport/IO.pm
cp lib/SOAP/Server.pm blib/lib/SOAP/Server.pm
cp lib/UDDI/Lite.pm blib/lib/UDDI/Lite.pm
cp lib/SOAP/Utils.pm blib/lib/SOAP/Utils.pm
cp lib/SOAP/Constants.pm blib/lib/SOAP/Constants.pm
cp lib/XMLRPC/Transport/POP3.pm blib/lib/XMLRPC/Transport/POP3.pm
cp lib/XMLRPC/Lite.pm blib/lib/XMLRPC/Lite.pm
cp lib/SOAP/Serializer.pm blib/lib/SOAP/Serializer.pm
cp lib/OldDocs/SOAP/Lite.pm blib/lib/OldDocs/SOAP/Lite.pm
cp lib/OldDocs/SOAP/Transport/HTTP.pm 
blib/lib/OldDocs/SOAP/Transport/HTTP.pm
cp lib/SOAP/Client.pm blib/lib/SOAP/Client.pm
cp lib/IO/SessionData.pm blib/lib/IO/SessionData.pm
cp lib/SOAP/SOM.pm blib/lib/SOAP/SOM.pm
cp lib/XMLRPC/Test.pm blib/lib/XMLRPC/Test.pm
cp lib/SOAP/Header.pm blib/lib/SOAP/Header.pm
cp lib/OldDocs/SOAP/Transport/FTP.pm blib/lib/OldDocs/SOAP/Transport/FTP.pm
cp lib/OldDocs/SOAP/Transport/MQ.pm blib/lib/OldDocs/SOAP/Transport/MQ.pm
cp lib/OldDocs/SOAP/Transport/JABBER.pm 
blib/lib/OldDocs/SOAP/Transport/JABBER.pm
cp lib/SOAP/Transport/TCP.pm blib/lib/SOAP/Transport/TCP.pm
cp lib/IO/SessionSet.pm blib/lib/IO/SessionSet.pm
cp lib/SOAP/Transport/HTTP.pm blib/lib/SOAP/Transport/HTTP.pm
cp lib/OldDocs/SOAP/Transport/IO.pm blib/lib/OldDocs/SOAP/Transport/IO.pm
cp lib/OldDocs/SOAP/Transport/LOCAL.pm 
blib/lib/OldDocs/SOAP/Transport/LOCAL.pm
cp lib/SOAP/Lite.pm blib/lib/SOAP/Lite.pm
cp lib/SOAP/Transport/LOCAL.pm blib/lib/SOAP/Transport/LOCAL.pm
cp lib/SOAP/Transport/FTP.pm blib/lib/SOAP/Transport/FTP.pm
cp lib/SOAP/Fault.pm blib/lib/SOAP/Fault.pm
cp lib/OldDocs/SOAP/Transport/MAILTO.pm 
blib/lib/OldDocs/SOAP/Transport/MAILTO.pm
cp bin/SOAPsh.pl blib/script/SOAPsh.pl
/usr/bin/perl "-MExtUtils::MY" -e "MY->fixin(shift)" blib/script/SOAPsh.pl
cp bin/stubmaker.pl blib/script/stubmaker.pl
/usr/bin/perl "-MExtUtils::MY" -e "MY->fixin(shift)" 
blib/script/stubmaker.pl
cp bin/XMLRPCsh.pl blib/script/XMLRPCsh.pl
/usr/bin/perl "-MExtUtils::MY" -e "MY->fixin(shift)" blib/script/XMLRPCsh.pl
Manifying blib/man1/SOAPsh.pl.1
Manifying blib/man1/stubmaker.pl.1
Manifying blib/man1/XMLRPCsh.pl.1
Manifying blib/man3/SOAP::Packager.3pm
Manifying blib/man3/XML::Parser::Lite.3pm
Manifying blib/man3/SOAP::Data.3pm
Manifying blib/man3/XMLRPC::Transport::TCP.3pm
Manifying blib/man3/OldDocs::SOAP::Transport::TCP.3pm
Manifying blib/man3/OldDocs::SOAP::Transport::POP3.3pm
Manifying blib/man3/SOAP::Test.3pm
Manifying blib/man3/Apache::SOAP.3pm
Manifying blib/man3/SOAP::Transport.3pm
Manifying blib/man3/Apache::XMLRPC::Lite.3pm
Manifying blib/man3/XMLRPC::Transport::HTTP.3pm
Manifying blib/man3/SOAP::Transport::POP3.3pm
Manifying blib/man3/SOAP::Deserializer.3pm
Manifying blib/man3/SOAP::Trace.3pm
Manifying blib/man3/SOAP::Schema.3pm
Manifying blib/man3/SOAP::Server.3pm
Manifying blib/man3/UDDI::Lite.3pm
Manifying blib/man3/SOAP::Utils.3pm
Manifying blib/man3/SOAP::Constants.3pm
Manifying blib/man3/XMLRPC::Transport::POP3.3pm
Manifying blib/man3/XMLRPC::Lite.3pm
Manifying blib/man3/SOAP::Serializer.3pm
Manifying blib/man3/OldDocs::SOAP::Lite.3pm
Manifying blib/man3/OldDocs::SOAP::Transport::HTTP.3pm
Manifying blib/man3/SOAP::Client.3pm
Manifying blib/man3/SOAP::SOM.3pm
Manifying blib/man3/XMLRPC::Test.3pm
Manifying blib/man3/SOAP::Header.3pm
Manifying blib/man3/OldDocs::SOAP::Transport::MQ.3pm
Manifying blib/man3/OldDocs::SOAP::Transport::FTP.3pm
Manifying blib/man3/OldDocs::SOAP::Transport::JABBER.3pm
Manifying blib/man3/OldDocs::SOAP::Transport::IO.3pm
Manifying blib/man3/OldDocs::SOAP::Transport::LOCAL.3pm
Manifying blib/man3/SOAP::Lite.3pm
Manifying blib/man3/OldDocs::SOAP::Transport::MAILTO.3pm
Manifying blib/man3/SOAP::Fault.3pm
   /usr/bin/make  -- OK
Running make test
PERL_DL_NONLAZY=1 /usr/bin/perl "-MExtUtils::Command::MM" "-e" 
"test_harness(0, 'blib/lib', 'blib/arch')" t/01-core.t t/02-payload.t 
t/03-server.t t/04-attach.t t/05-customxml.t t/06-modules.t 
t/07-xmlrpc_payload.t t/08-schema.t
t/01-core..............ok 

         3/35 skipped: various reasons
t/02-payload...........ok 113/125Could not load UserAgent class 
LWP::UserAgent: Can't locate LWP/UserAgent.pm in @INC (@INC contains: 
/Users/elharo/.cpan/build/SOAP-Lite-0.69/blib/lib 
/Users/elharo/.cpan/build/SOAP-Lite-0.69/blib/arch /sw/lib/perl5 
/sw/lib/perl5/darwin 
/System/Library/Perl/5.8.6/darwin-thread-multi-2level 
/System/Library/Perl/5.8.6/darwin-thread-multi-2level 
/System/Library/Perl/5.8.6 
/Library/Perl/5.8.6/darwin-thread-multi-2level 
/Library/Perl/5.8.6/darwin-thread-multi-2level /Library/Perl/5.8.6 
/Library/Perl/5.8.6/darwin-thread-multi-2level /Library/Perl/5.8.6 
/Library/Perl /Network/Library/Perl/5.8.6/darwin-thread-multi-2level 
/Network/Library/Perl/5.8.6 /Network/Library/Perl 
/System/Library/Perl/Extras/5.8.6/darwin-thread-multi-2level 
/System/Library/Perl/Extras/5.8.6/darwin-thread-multi-2level 
/System/Library/Perl/Extras/5.8.6 /Library/Perl/5.8.1 . 
/System/Library/Perl/5.8.6/darwin-thread-multi-2level 
/System/Library/Perl/5.8.6 
/Library/Perl/5.8.6/darwin-thread-multi-2level /Library/Perl/5.8.6 
/Library/Perl /Network/Library/Perl/5.8.6/darwin-thread-multi-2level 
/Network/Library/Perl/5.8.6 /Network/Library/Perl 
/System/Library/Perl/Extras/5.8.6/darwin-thread-multi-2level 
/System/Library/Perl/Extras/5.8.6 /Library/Perl/5.8.1 .) at (eval 294) 
line 3.
t/02-payload...........dubious 

         Test returned status 2 (wstat 512, 0x200)
DIED. FAILED tests 114-125
         Failed 12/125 tests, 90.40% okay
t/03-server............NOK 2# Failed test 2 in t/03-server.t at line 174 

#  t/03-server.t line 174 is:     skip(($_ =~ /XML/ || 
!$is_mimetools_installed),
t/03-server............NOK 3# Failed test 3 in t/03-server.t at line 174 
fail #2
t/03-server............NOK 4# Failed test 4 in t/03-server.t at line 174 
fail #3
t/03-server............NOK 7# Failed test 7 in t/03-server.t at line 182 

#  t/03-server.t line 182 is:     skip(($_ =~ /XML/ || 
!$is_mimetools_installed),
t/03-server............NOK 8# Failed test 8 in t/03-server.t at line 182 
fail #2
t/03-server............NOK 9# Failed test 9 in t/03-server.t at line 182 
fail #3
t/03-server............FAILED tests 2-4, 7-9 

         Failed 6/32 tests, 81.25% okay (less 2 skipped tests: 24 okay, 
75.00%)
t/04-attach............Something wrong with MIME message: MIME::Parser: 
can't flush:  at /System/Library/Perl/Extras/5.8.6/MIME/Parser.pm line 789.

t/04-attach............dubious 

         Test returned status 255 (wstat 65280, 0xff00)
DIED. FAILED tests 1-15
         Failed 15/15 tests, 0.00% okay
t/05-customxml.........ok 

t/06-modules...........ok 

         5/19 skipped: various reasons
t/07-xmlrpc_payload....ok 

t/08-schema............ok 

Failed Test    Stat Wstat Total Fail  Failed  List of Failed
-------------------------------------------------------------------------------
t/02-payload.t    2   512   125   24  19.20%  114-125
t/03-server.t                32    6  18.75%  2-4 7-9
t/04-attach.t   255 65280    15   30 200.00%  1-15
10 subtests skipped.
Failed 3/8 test scripts, 62.50% okay. 33/321 subtests failed, 89.72% okay.
make: *** [test_dynamic] Error 2
   /usr/bin/make test -- NOT OK
Running make install
   make test had returned bad status, won't install without force
Running install for module LWP::UserAgent
Running make for G/GA/GAAS/libwww-perl-5.805.tar.gz
Checksum for 
/Users/elharo/.cpan/sources/authors/id/G/GA/GAAS/libwww-perl-5.805.tar.gz ok
libwww-perl-5.805/
libwww-perl-5.805/lib/
libwww-perl-5.805/lib/HTTP/
libwww-perl-5.805/lib/HTTP/Cookies.pm
libwww-perl-5.805/lib/HTTP/Status.pm
libwww-perl-5.805/lib/HTTP/Cookies/
libwww-perl-5.805/lib/HTTP/Cookies/Netscape.pm
libwww-perl-5.805/lib/HTTP/Cookies/Microsoft.pm
libwww-perl-5.805/lib/HTTP/Request/
libwww-perl-5.805/lib/HTTP/Request/Common.pm
libwww-perl-5.805/lib/HTTP/Headers/
libwww-perl-5.805/lib/HTTP/Headers/Auth.pm
libwww-perl-5.805/lib/HTTP/Headers/ETag.pm
libwww-perl-5.805/lib/HTTP/Headers/Util.pm
libwww-perl-5.805/lib/HTTP/Request.pm
libwww-perl-5.805/lib/HTTP/Response.pm
libwww-perl-5.805/lib/HTTP/Date.pm
libwww-perl-5.805/lib/HTTP/Daemon.pm
libwww-perl-5.805/lib/HTTP/Message.pm
libwww-perl-5.805/lib/HTTP/Negotiate.pm
libwww-perl-5.805/lib/HTTP/Headers.pm
libwww-perl-5.805/lib/LWP/
libwww-perl-5.805/lib/LWP/Protocol/
libwww-perl-5.805/lib/LWP/Protocol/nntp.pm
libwww-perl-5.805/lib/LWP/Protocol/ftp.pm
libwww-perl-5.805/lib/LWP/Protocol/mailto.pm
libwww-perl-5.805/lib/LWP/Protocol/GHTTP.pm
libwww-perl-5.805/lib/LWP/Protocol/nogo.pm
libwww-perl-5.805/lib/LWP/Protocol/file.pm
libwww-perl-5.805/lib/LWP/Protocol/loopback.pm
libwww-perl-5.805/lib/LWP/Protocol/data.pm
libwww-perl-5.805/lib/LWP/Protocol/https10.pm
libwww-perl-5.805/lib/LWP/Protocol/http10.pm
libwww-perl-5.805/lib/LWP/Protocol/https.pm
libwww-perl-5.805/lib/LWP/Protocol/gopher.pm
libwww-perl-5.805/lib/LWP/Protocol/cpan.pm
libwww-perl-5.805/lib/LWP/Protocol/http.pm
libwww-perl-5.805/lib/LWP/RobotUA.pm
libwww-perl-5.805/lib/LWP/Authen/
libwww-perl-5.805/lib/LWP/Authen/Ntlm.pm
libwww-perl-5.805/lib/LWP/Authen/Digest.pm
libwww-perl-5.805/lib/LWP/Authen/Basic.pm
libwww-perl-5.805/lib/LWP/MemberMixin.pm
libwww-perl-5.805/lib/LWP/media.types
libwww-perl-5.805/lib/LWP/DebugFile.pm
libwww-perl-5.805/lib/LWP/Debug.pm
libwww-perl-5.805/lib/LWP/UserAgent.pm
libwww-perl-5.805/lib/LWP/MediaTypes.pm
libwww-perl-5.805/lib/LWP/Protocol.pm
libwww-perl-5.805/lib/LWP/ConnCache.pm
libwww-perl-5.805/lib/LWP/Simple.pm
libwww-perl-5.805/lib/WWW/
libwww-perl-5.805/lib/WWW/RobotRules/
libwww-perl-5.805/lib/WWW/RobotRules/AnyDBM_File.pm
libwww-perl-5.805/lib/WWW/RobotRules.pm
libwww-perl-5.805/lib/File/
libwww-perl-5.805/lib/File/Listing.pm
libwww-perl-5.805/lib/Net/
libwww-perl-5.805/lib/Net/HTTP/
libwww-perl-5.805/lib/Net/HTTP/Methods.pm
libwww-perl-5.805/lib/Net/HTTP/NB.pm
libwww-perl-5.805/lib/Net/HTTP.pm
libwww-perl-5.805/lib/Net/HTTPS.pm
libwww-perl-5.805/lib/Bundle/
libwww-perl-5.805/lib/Bundle/LWP.pm
libwww-perl-5.805/lib/LWP.pm
libwww-perl-5.805/lib/HTML/
libwww-perl-5.805/lib/HTML/Form.pm
libwww-perl-5.805/t/
libwww-perl-5.805/t/base/
libwww-perl-5.805/t/base/headers-util.t
libwww-perl-5.805/t/base/status.t
libwww-perl-5.805/t/base/cookies.t
libwww-perl-5.805/t/base/headers-etag.t
libwww-perl-5.805/t/base/http.t
libwww-perl-5.805/t/base/date.t
libwww-perl-5.805/t/base/listing.t
libwww-perl-5.805/t/base/response.t
libwww-perl-5.805/t/base/headers-auth.t
libwww-perl-5.805/t/base/common-req.t
libwww-perl-5.805/t/base/protocols.t
libwww-perl-5.805/t/base/message.t
libwww-perl-5.805/t/base/mediatypes.t
libwww-perl-5.805/t/base/ua.t
libwww-perl-5.805/t/base/headers.t
libwww-perl-5.805/t/base/negotiate.t
libwww-perl-5.805/t/base/message-old.t
libwww-perl-5.805/t/base/message-parts.t
libwww-perl-5.805/t/local/
libwww-perl-5.805/t/local/get.t
libwww-perl-5.805/t/local/autoload.t
libwww-perl-5.805/t/local/http.t
libwww-perl-5.805/t/local/http-get.t
libwww-perl-5.805/t/local/autoload-get.t
libwww-perl-5.805/t/local/protosub.t
libwww-perl-5.805/t/live/
libwww-perl-5.805/t/live/jigsaw-te.t
libwww-perl-5.805/t/live/validator.t
libwww-perl-5.805/t/live/jigsaw-md5-get.t
libwww-perl-5.805/t/live/jigsaw-neg.t
libwww-perl-5.805/t/live/jigsaw-auth-d.t
libwww-perl-5.805/t/live/apache-listing.t
libwww-perl-5.805/t/live/jigsaw-md5.t
libwww-perl-5.805/t/live/jigsaw-neg-get.t
libwww-perl-5.805/t/live/jigsaw-chunk.t
libwww-perl-5.805/t/live/jigsaw-auth-b.t
libwww-perl-5.805/t/live/activestate.t
libwww-perl-5.805/t/net/
libwww-perl-5.805/t/net/http-get.t
libwww-perl-5.805/t/net/cgi-bin/
libwww-perl-5.805/t/net/cgi-bin/nph-slowdata
libwww-perl-5.805/t/net/cgi-bin/moved
libwww-perl-5.805/t/net/cgi-bin/test
libwww-perl-5.805/t/net/cgi-bin/slowread
libwww-perl-5.805/t/net/cgi-bin/timeout
libwww-perl-5.805/t/net/proxy.t
libwww-perl-5.805/t/net/http-post.t
libwww-perl-5.805/t/net/moved.t
libwww-perl-5.805/t/net/http-timeout.t
libwww-perl-5.805/t/net/config.pl.dist
libwww-perl-5.805/t/net/mirror.t
libwww-perl-5.805/t/robot/
libwww-perl-5.805/t/robot/rules.t
libwww-perl-5.805/t/robot/ua.t
libwww-perl-5.805/t/robot/ua-get.t
libwww-perl-5.805/t/robot/rules-dbm.t
libwww-perl-5.805/t/README
libwww-perl-5.805/t/html/
libwww-perl-5.805/t/html/form-param.t
libwww-perl-5.805/t/html/form.t
libwww-perl-5.805/t/TEST
libwww-perl-5.805/bin/
libwww-perl-5.805/bin/lwp-rget
libwww-perl-5.805/bin/lwp-mirror
libwww-perl-5.805/bin/lwp-download
libwww-perl-5.805/bin/lwp-request
libwww-perl-5.805/Makefile.PL
libwww-perl-5.805/talk-to-ourself
libwww-perl-5.805/lwptut.pod
libwww-perl-5.805/MANIFEST
libwww-perl-5.805/README.SSL
libwww-perl-5.805/Changes
libwww-perl-5.805/AUTHORS
libwww-perl-5.805/README
libwww-perl-5.805/lwpcook.pod

   CPAN.pm: Going to build G/GA/GAAS/libwww-perl-5.805.tar.gz


This package comes with some sample programs that I can try
to install in /usr/bin.

    Note that you can avoid these questions by passing
    the '-n' option to 'Makefile.PL'.

Do you want to install lwp-request? [y]
Do you want to install lwp-mirror? [y]
Do you want to install lwp-rget? [y]
Do you want to install lwp-download? [y]

The lwp-request program will use the name it is invoked with to
determine what HTTP method to use.  I can set up alias for the most
common HTTP methods.  These alias are also installed in
/usr/bin.

Do you want to install the GET alias? [n]
Do you want to install the HEAD alias? [n]
Do you want to install the POST alias? [n]

Checking for URI........... ok
Checking for HTML::Parser.. ok
Checking for MIME::Base64.. ok
Checking for Net::FTP...... ok
Checking for Digest::MD5 .. ok

Checking if your kit is complete...
Looks good
Writing Makefile for LWP
cp lib/LWP/RobotUA.pm blib/lib/LWP/RobotUA.pm
cp lib/LWP/Authen/Ntlm.pm blib/lib/LWP/Authen/Ntlm.pm
cp lib/LWP.pm blib/lib/LWP.pm
cp lib/HTTP/Headers/ETag.pm blib/lib/HTTP/Headers/ETag.pm
cp lib/LWP/Protocol.pm blib/lib/LWP/Protocol.pm
cp lwptut.pod blib/lib/lwptut.pod
cp lib/HTTP/Request/Common.pm blib/lib/HTTP/Request/Common.pm
cp lib/HTTP/Message.pm blib/lib/HTTP/Message.pm
cp lib/LWP/Protocol/ftp.pm blib/lib/LWP/Protocol/ftp.pm
cp lib/HTML/Form.pm blib/lib/HTML/Form.pm
cp lib/HTTP/Cookies/Netscape.pm blib/lib/HTTP/Cookies/Netscape.pm
cp lib/LWP/Authen/Digest.pm blib/lib/LWP/Authen/Digest.pm
cp lib/LWP/Protocol/gopher.pm blib/lib/LWP/Protocol/gopher.pm
cp lib/Net/HTTP/NB.pm blib/lib/Net/HTTP/NB.pm
cp lib/HTTP/Status.pm blib/lib/HTTP/Status.pm
cp lib/LWP/Protocol/cpan.pm blib/lib/LWP/Protocol/cpan.pm
cp lib/Net/HTTPS.pm blib/lib/Net/HTTPS.pm
cp lib/HTTP/Headers/Util.pm blib/lib/HTTP/Headers/Util.pm
cp lib/LWP/Authen/Basic.pm blib/lib/LWP/Authen/Basic.pm
cp lib/HTTP/Cookies/Microsoft.pm blib/lib/HTTP/Cookies/Microsoft.pm
cp lib/LWP/UserAgent.pm blib/lib/LWP/UserAgent.pm
cp lib/LWP/Protocol/loopback.pm blib/lib/LWP/Protocol/loopback.pm
cp lib/LWP/Protocol/nntp.pm blib/lib/LWP/Protocol/nntp.pm
cp lib/LWP/Protocol/http.pm blib/lib/LWP/Protocol/http.pm
cp lib/LWP/Protocol/https10.pm blib/lib/LWP/Protocol/https10.pm
cp lib/LWP/Protocol/mailto.pm blib/lib/LWP/Protocol/mailto.pm
cp lib/LWP/MemberMixin.pm blib/lib/LWP/MemberMixin.pm
cp lib/HTTP/Headers/Auth.pm blib/lib/HTTP/Headers/Auth.pm
cp lib/LWP/Debug.pm blib/lib/LWP/Debug.pm
cp lib/Net/HTTP.pm blib/lib/Net/HTTP.pm
cp lib/LWP/media.types blib/lib/LWP/media.types
cp lib/HTTP/Daemon.pm blib/lib/HTTP/Daemon.pm
cp lib/HTTP/Cookies.pm blib/lib/HTTP/Cookies.pm
cp lib/LWP/ConnCache.pm blib/lib/LWP/ConnCache.pm
cp lib/File/Listing.pm blib/lib/File/Listing.pm
cp lib/WWW/RobotRules/AnyDBM_File.pm blib/lib/WWW/RobotRules/AnyDBM_File.pm
cp lib/LWP/MediaTypes.pm blib/lib/LWP/MediaTypes.pm
cp lwpcook.pod blib/lib/lwpcook.pod
cp lib/HTTP/Date.pm blib/lib/HTTP/Date.pm
cp lib/LWP/Protocol/file.pm blib/lib/LWP/Protocol/file.pm
cp lib/LWP/Protocol/http10.pm blib/lib/LWP/Protocol/http10.pm
cp lib/LWP/Protocol/GHTTP.pm blib/lib/LWP/Protocol/GHTTP.pm
cp lib/LWP/DebugFile.pm blib/lib/LWP/DebugFile.pm
cp lib/HTTP/Negotiate.pm blib/lib/HTTP/Negotiate.pm
cp lib/HTTP/Request.pm blib/lib/HTTP/Request.pm
cp lib/WWW/RobotRules.pm blib/lib/WWW/RobotRules.pm
cp lib/LWP/Protocol/data.pm blib/lib/LWP/Protocol/data.pm
cp lib/LWP/Protocol/nogo.pm blib/lib/LWP/Protocol/nogo.pm
cp lib/HTTP/Response.pm blib/lib/HTTP/Response.pm
cp lib/LWP/Simple.pm blib/lib/LWP/Simple.pm
cp lib/HTTP/Headers.pm blib/lib/HTTP/Headers.pm
cp lib/LWP/Protocol/https.pm blib/lib/LWP/Protocol/https.pm
cp lib/Bundle/LWP.pm blib/lib/Bundle/LWP.pm
cp lib/Net/HTTP/Methods.pm blib/lib/Net/HTTP/Methods.pm
cp bin/lwp-mirror blib/script/lwp-mirror
/usr/bin/perl "-MExtUtils::MY" -e "MY->fixin(shift)" blib/script/lwp-mirror
cp bin/lwp-download blib/script/lwp-download
/usr/bin/perl "-MExtUtils::MY" -e "MY->fixin(shift)" 
blib/script/lwp-download
cp bin/lwp-rget blib/script/lwp-rget
/usr/bin/perl "-MExtUtils::MY" -e "MY->fixin(shift)" blib/script/lwp-rget
cp bin/lwp-request blib/script/lwp-request
/usr/bin/perl "-MExtUtils::MY" -e "MY->fixin(shift)" blib/script/lwp-request
Manifying blib/man1/lwp-mirror.1
Manifying blib/man1/lwp-download.1
Manifying blib/man1/lwp-rget.1
Manifying blib/man1/lwp-request.1
Manifying blib/man3/LWP::RobotUA.3pm
Manifying blib/man3/LWP::Authen::Ntlm.3pm
Manifying blib/man3/LWP.3pm
Manifying blib/man3/LWP::Protocol.3pm
Manifying blib/man3/HTTP::Request::Common.3pm
Manifying blib/man3/lwptut.3pm
Manifying blib/man3/HTTP::Message.3pm
Manifying blib/man3/HTML::Form.3pm
Manifying blib/man3/HTTP::Cookies::Netscape.3pm
Manifying blib/man3/Net::HTTP::NB.3pm
Manifying blib/man3/HTTP::Status.3pm
Manifying blib/man3/HTTP::Headers::Util.3pm
Manifying blib/man3/HTTP::Cookies::Microsoft.3pm
Manifying blib/man3/LWP::UserAgent.3pm
Manifying blib/man3/LWP::MemberMixin.3pm
Manifying blib/man3/LWP::Debug.3pm
Manifying blib/man3/Net::HTTP.3pm
Manifying blib/man3/HTTP::Daemon.3pm
Manifying blib/man3/HTTP::Cookies.3pm
Manifying blib/man3/LWP::ConnCache.3pm
Manifying blib/man3/File::Listing.3pm
Manifying blib/man3/WWW::RobotRules::AnyDBM_File.3pm
Manifying blib/man3/lwpcook.3pm
Manifying blib/man3/LWP::MediaTypes.3pm
Manifying blib/man3/HTTP::Date.3pm
Manifying blib/man3/WWW::RobotRules.3pm
Manifying blib/man3/HTTP::Request.3pm
Manifying blib/man3/HTTP::Negotiate.3pm
Manifying blib/man3/LWP::DebugFile.3pm
Manifying blib/man3/HTTP::Response.3pm
Manifying blib/man3/HTTP::Headers.3pm
Manifying blib/man3/LWP::Simple.3pm
Manifying blib/man3/Bundle::LWP.3pm
   /usr/bin/make  -- OK
Running make test
/usr/bin/perl t/TEST 0
base/common-req.......ok 

base/cookies..........ok 

base/date.............ok 

base/headers-auth.....ok 

base/headers-etag.....ok 

base/headers-util.....ok 

base/headers..........ok 

base/http.............ok 

base/listing..........ok 

base/mediatypes.......ok 

base/message-old......ok 

base/message-parts....ok 

base/message..........ok 

base/negotiate........ok 

base/protocols........ok 

base/response.........ok 

base/status...........ok 

base/ua...............ok 

html/form-param.......Can't locate HTML/Tagset.pm in @INC (@INC 
contains: ../blib/lib ../blib/arch /sw/lib/perl5 /sw/lib/perl5/darwin 
/System/Library/Perl/5.8.6/darwin-thread-multi-2level 
/System/Library/Perl/5.8.6/darwin-thread-multi-2level 
/System/Library/Perl/5.8.6 
/Library/Perl/5.8.6/darwin-thread-multi-2level 
/Library/Perl/5.8.6/darwin-thread-multi-2level /Library/Perl/5.8.6 
/Library/Perl/5.8.6/darwin-thread-multi-2level /Library/Perl/5.8.6 
/Library/Perl /Network/Library/Perl/5.8.6/darwin-thread-multi-2level 
/Network/Library/Perl/5.8.6 /Network/Library/Perl 
/System/Library/Perl/Extras/5.8.6/darwin-thread-multi-2level 
/System/Library/Perl/Extras/5.8.6/darwin-thread-multi-2level 
/System/Library/Perl/Extras/5.8.6 /Library/Perl/5.8.1 ../. 
/System/Library/Perl/5.8.6/darwin-thread-multi-2level 
/System/Library/Perl/5.8.6 
/Library/Perl/5.8.6/darwin-thread-multi-2level /Library/Perl/5.8.6 
/Library/Perl /Network/Library/Perl/5.8.6/darwin-thread-multi-2level 
/Network/Library/Perl/5.8.6 /Network/Library/Perl 
/System/Library/Perl/Extras/5.8.6/darwin-thread-multi-2level 
/System/Library/Perl/Extras/5.8.6 /Library/Perl/5.8.1 .) at 
/System/Library/Perl/Extras/5.8.6/darwin-thread-multi-2level/HTML/TokeParser.pm 
line 12.
BEGIN failed--compilation aborted at 
/System/Library/Perl/Extras/5.8.6/darwin-thread-multi-2level/HTML/TokeParser.pm 
line 12.
Compilation failed in require at ../blib/lib/HTML/Form.pm line 116.
html/form-param.......dubious 

         Test returned status 2 (wstat 512, 0x200)
DIED. FAILED tests 1-24
         Failed 24/24 tests, 0.00% okay
html/form.............Can't locate HTML/Tagset.pm in @INC (@INC 
contains: ../blib/lib ../blib/arch /sw/lib/perl5 /sw/lib/perl5/darwin 
/System/Library/Perl/5.8.6/darwin-thread-multi-2level 
/System/Library/Perl/5.8.6/darwin-thread-multi-2level 
/System/Library/Perl/5.8.6 
/Library/Perl/5.8.6/darwin-thread-multi-2level 
/Library/Perl/5.8.6/darwin-thread-multi-2level /Library/Perl/5.8.6 
/Library/Perl/5.8.6/darwin-thread-multi-2level /Library/Perl/5.8.6 
/Library/Perl /Network/Library/Perl/5.8.6/darwin-thread-multi-2level 
/Network/Library/Perl/5.8.6 /Network/Library/Perl 
/System/Library/Perl/Extras/5.8.6/darwin-thread-multi-2level 
/System/Library/Perl/Extras/5.8.6/darwin-thread-multi-2level 
/System/Library/Perl/Extras/5.8.6 /Library/Perl/5.8.1 ../. 
/System/Library/Perl/5.8.6/darwin-thread-multi-2level 
/System/Library/Perl/5.8.6 
/Library/Perl/5.8.6/darwin-thread-multi-2level /Library/Perl/5.8.6 
/Library/Perl /Network/Library/Perl/5.8.6/darwin-thread-multi-2level 
/Network/Library/Perl/5.8.6 /Network/Library/Perl 
/System/Library/Perl/Extras/5.8.6/darwin-thread-multi-2level 
/System/Library/Perl/Extras/5.8.6 /Library/Perl/5.8.1 .) at 
/System/Library/Perl/Extras/5.8.6/darwin-thread-multi-2level/HTML/TokeParser.pm 
line 12.
BEGIN failed--compilation aborted at 
/System/Library/Perl/Extras/5.8.6/darwin-thread-multi-2level/HTML/TokeParser.pm 
line 12.
Compilation failed in require at ../blib/lib/HTML/Form.pm line 116.
html/form.............dubious 

         Test returned status 2 (wstat 512, 0x200)
DIED. FAILED tests 1-122
         Failed 122/122 tests, 0.00% okay
robot/rules-dbm.......ok 

robot/rules...........ok 

robot/ua-get..........ok 

robot/ua..............ok 

local/autoload-get....ok 

local/autoload........ok 

local/get.............ok 

local/http-get........ok 

local/http............ok 

local/protosub........ok 

Failed Test       Stat Wstat Total Fail  Failed  List of Failed
-------------------------------------------------------------------------------
html/form-param.t    2   512    24   48 200.00%  1-24
html/form.t          2   512   122  244 200.00%  1-122
Failed 2/30 test scripts, 93.33% okay. 146/799 subtests failed, 81.73% okay.
make: *** [test] Error 2
   /usr/bin/make test -- NOT OK
Running make install
   make test had returned bad status, won't install without force
Running install for module Class::Accessor
Running make for K/KA/KASEI/Class-Accessor-0.30.tar.gz
Checksum for 
/Users/elharo/.cpan/sources/authors/id/K/KA/KASEI/Class-Accessor-0.30.tar.gz 
ok
Class-Accessor-0.30/
Class-Accessor-0.30/t/
Class-Accessor-0.30/t/croak.t
Class-Accessor-0.30/t/bestpractice.t
Class-Accessor-0.30/t/getset.t
Class-Accessor-0.30/t/aliases.t
Class-Accessor-0.30/t/accessors.t
Class-Accessor-0.30/lib/
Class-Accessor-0.30/lib/Class/
Class-Accessor-0.30/lib/Class/Accessor/
Class-Accessor-0.30/lib/Class/Accessor/Faster.pm
Class-Accessor-0.30/lib/Class/Accessor/Fast.pm
Class-Accessor-0.30/lib/Class/Accessor.pm
Class-Accessor-0.30/README
Class-Accessor-0.30/Changes
Class-Accessor-0.30/Makefile.PL
Class-Accessor-0.30/META.yml
Class-Accessor-0.30/INSTALL
Class-Accessor-0.30/examples/
Class-Accessor-0.30/examples/benchmark
Class-Accessor-0.30/MANIFEST

   CPAN.pm: Going to build K/KA/KASEI/Class-Accessor-0.30.tar.gz

Checking if your kit is complete...
Looks good
Writing Makefile for Class::Accessor
cp lib/Class/Accessor/Fast.pm blib/lib/Class/Accessor/Fast.pm
cp lib/Class/Accessor/Faster.pm blib/lib/Class/Accessor/Faster.pm
cp lib/Class/Accessor.pm blib/lib/Class/Accessor.pm
Manifying blib/man3/Class::Accessor::Faster.3pm
Manifying blib/man3/Class::Accessor::Fast.3pm
Manifying blib/man3/Class::Accessor.3pm
   /usr/bin/make  -- OK
Running make test
PERL_DL_NONLAZY=1 /usr/bin/perl "-MExtUtils::Command::MM" "-e" 
"test_harness(0, 'blib/lib', 'blib/arch')" t/*.t
t/accessors.......ok 

t/aliases.........ok 

t/bestpractice....ok 

t/croak...........ok 

t/getset..........ok 

All tests successful.
Files=5, Tests=114,  1 wallclock secs ( 0.28 cusr +  0.07 csys =  0.35 CPU)
   /usr/bin/make test -- OK
Running make install
Installing /Library/Perl/5.8.6/Class/Accessor.pm
Installing /Library/Perl/5.8.6/Class/Accessor/Fast.pm
Installing /Library/Perl/5.8.6/Class/Accessor/Faster.pm
Installing /usr/local/man/man3/Class::Accessor.3pm
Installing /usr/local/man/man3/Class::Accessor::Fast.3pm
Installing /usr/local/man/man3/Class::Accessor::Faster.3pm
Writing 
/Library/Perl/5.8.6/darwin-thread-multi-2level/auto/Class/Accessor/.packlist
Appending installation info to 
//System/Library/Perl/5.8.6/darwin-thread-multi-2level/perllocal.pod
   /usr/bin/make install  -- OK
Running make for 
O/OL/OLIVIERT/WebService/WebService-Validator-CSS-W3C-0.2.tar.gz
   Is already unwrapped into directory 
/Users/elharo/.cpan/build/WebService-Validator-CSS-W3C-0.2

   CPAN.pm: Going to build 
O/OL/OLIVIERT/WebService/WebService-Validator-CSS-W3C-0.2.tar.gz

cp lib/WebService/Validator/CSS/W3C.pm 
blib/lib/WebService/Validator/CSS/W3C.pm
Manifying blib/man3/WebService::Validator::CSS::W3C.3pm
   /usr/bin/make  -- OK
Running make test
PERL_DL_NONLAZY=1 /usr/bin/perl "-MExtUtils::Command::MM" "-e" 
"test_harness(0, 'blib/lib', 'blib/arch')" t/*.t
t/WebService-Validator-CSS-W3C....Can't locate SOAP/Lite.pm in @INC 
(@INC contains: 
/Users/elharo/.cpan/build/WebService-Validator-CSS-W3C-0.2/blib/lib 
/Users/elharo/.cpan/build/WebService-Validator-CSS-W3C-0.2/blib/arch 
/sw/lib/perl5 /sw/lib/perl5/darwin 
/System/Library/Perl/5.8.6/darwin-thread-multi-2level 
/System/Library/Perl/5.8.6/darwin-thread-multi-2level 
/System/Library/Perl/5.8.6 
/Library/Perl/5.8.6/darwin-thread-multi-2level 
/Library/Perl/5.8.6/darwin-thread-multi-2level /Library/Perl/5.8.6 
/Library/Perl/5.8.6/darwin-thread-multi-2level /Library/Perl/5.8.6 
/Library/Perl /Network/Library/Perl/5.8.6/darwin-thread-multi-2level 
/Network/Library/Perl/5.8.6 /Network/Library/Perl 
/System/Library/Perl/Extras/5.8.6/darwin-thread-multi-2level 
/System/Library/Perl/Extras/5.8.6/darwin-thread-multi-2level 
/System/Library/Perl/Extras/5.8.6 /Library/Perl/5.8.1 . 
/System/Library/Perl/5.8.6/darwin-thread-multi-2level 
/System/Library/Perl/5.8.6 
/Library/Perl/5.8.6/darwin-thread-multi-2level /Library/Perl/5.8.6 
/Library/Perl /Network/Library/Perl/5.8.6/darwin-thread-multi-2level 
/Network/Library/Perl/5.8.6 /Network/Library/Perl 
/System/Library/Perl/Extras/5.8.6/darwin-thread-multi-2level 
/System/Library/Perl/Extras/5.8.6 /Library/Perl/5.8.1 .) at 
/Users/elharo/.cpan/build/WebService-Validator-CSS-W3C-0.2/blib/lib/WebService/Validator/CSS/W3C.pm 
line 5.
BEGIN failed--compilation aborted at 
/Users/elharo/.cpan/build/WebService-Validator-CSS-W3C-0.2/blib/lib/WebService/Validator/CSS/W3C.pm 
line 5.
Compilation failed in require at t/WebService-Validator-CSS-W3C.t line 10.
BEGIN failed--compilation aborted at t/WebService-Validator-CSS-W3C.t 
line 10.
t/WebService-Validator-CSS-W3C....dubious 

         Test returned status 2 (wstat 512, 0x200)
DIED. FAILED tests 1-3
         Failed 3/3 tests, 0.00% okay
Failed Test                      Stat Wstat Total Fail  Failed  List of 
Failed
-------------------------------------------------------------------------------
t/WebService-Validator-CSS-W3C.t    2   512     3    6 200.00%  1-3
Failed 1/1 test scripts, 0.00% okay. 3/3 subtests failed, 0.00% okay.
make: *** [test_dynamic] Error 2
   /usr/bin/make test -- NOT OK
Running make install
   make test had returned bad status, won't install without force
Running install for module LWP::UserAgent
Running make for G/GA/GAAS/libwww-perl-5.805.tar.gz
   Is already unwrapped into directory 
/Users/elharo/.cpan/build/libwww-perl-5.805
   Has already been processed within this session
Running make test
   Won't repeat unsuccessful test during this command
Running make install
   make test had returned bad status, won't install without force
Running install for module Mail::Sendmail
Running make for M/MI/MIVKOVIC/Mail-Sendmail-0.79.tar.gz
Checksum for 
/Users/elharo/.cpan/sources/authors/id/M/MI/MIVKOVIC/Mail-Sendmail-0.79.tar.gz 
ok
Mail-Sendmail-0.79/
Mail-Sendmail-0.79/Todo
Mail-Sendmail-0.79/README
Mail-Sendmail-0.79/MANIFEST
Mail-Sendmail-0.79/test.pl
Mail-Sendmail-0.79/Sendmail.pm
Mail-Sendmail-0.79/Changes
Mail-Sendmail-0.79/Makefile.PL
Mail-Sendmail-0.79/Sendmail.html

   CPAN.pm: Going to build M/MI/MIVKOVIC/Mail-Sendmail-0.79.tar.gz

Checking if your kit is complete...
Looks good
Writing Makefile for Mail::Sendmail
**********************************************************************

NOTE
----

The test (test.pl) is a real test for this module: it sends an e-mail.

You may want to edit test.pl before running it (directly or through
make test), so the mail is sent to you. If you also leave my address,
the mail goes into a database from which I can get statistics.

Read the docs, and have fun...

**********************************************************************
cp Sendmail.pm blib/lib/Mail/Sendmail.pm
Manifying blib/man3/Mail::Sendmail.3pm
   /usr/bin/make  -- OK
Running make test
PERL_DL_NONLAZY=1 /usr/bin/perl "-Iblib/lib" "-Iblib/arch" test.pl
1..2
Test Mail::Sendmail 0.79

Trying to send a message to the author (and/or whoever if you edited 
test.pl)

(The test is designed so it can be run by Test::Harness from CPAN.pm.
Edit it to send the mail to yourself for more concrete feedback. If you
do this, you also need to specify a different mail server, and possibly
a different From: address.)

Current recipient(s): 'Sendmail Test <sendmail@alma.ch>'

ok 1
Server set to: mail.alma.ch
Sending...
content of $Mail::Sendmail::log:
Mail::Sendmail v. 0.79 - Thu Feb  1 14:20:10 2007
Date: Thu, 1 Feb 2007 14:20:10 -0500
Server: mail.alma.ch Port: 25
From: sendmail@alma.ch
Subject: Mail::Sendmail version 0.79 test
To: sendmail@alma.ch

Result: 250 Ok: queued as AD0B21CE55
ok 2
   /usr/bin/make test -- OK
Running make install
Installing /Library/Perl/5.8.6/Mail/Sendmail.pm
Installing /usr/local/man/man3/Mail::Sendmail.3pm
Writing 
/Library/Perl/5.8.6/darwin-thread-multi-2level/auto/Mail/Sendmail/.packlist
Appending installation info to 
//System/Library/Perl/5.8.6/darwin-thread-multi-2level/perllocal.pod
   /usr/bin/make install  -- OK
Running install for module Config::General
Running make for T/TL/TLINDEN/Config-General-2.31.tar.gz
Checksum for 
/Users/elharo/.cpan/sources/authors/id/T/TL/TLINDEN/Config-General-2.31.tar.gz 
ok
Config-General-2.31/
Config-General-2.31/General/
Config-General-2.31/General/Extended.pm
Config-General-2.31/General/Interpolated.pm
Config-General-2.31/t/
Config-General-2.31/t/sub1/
Config-General-2.31/t/sub1/sub2/
Config-General-2.31/t/sub1/sub2/sub3/
Config-General-2.31/t/sub1/sub2/sub3/cfg.sub3.orig
Config-General-2.31/t/sub1/sub2/sub3/cfg.sub3
Config-General-2.31/t/sub1/sub2/cfg.sub2.orig
Config-General-2.31/t/sub1/sub2/cfg.sub2
Config-General-2.31/t/sub1/sub2/cfg.sub2b.orig
Config-General-2.31/t/sub1/sub2/cfg.sub2b
Config-General-2.31/t/sub1/cfg.sub1.orig
Config-General-2.31/t/sub1/cfg.sub1
Config-General-2.31/t/sub1/cfg.sub1b.orig
Config-General-2.31/t/sub1/cfg.sub1b
Config-General-2.31/t/sub1/cfg.sub1c.orig
Config-General-2.31/t/sub1/cfg.sub1c
Config-General-2.31/t/sub1/cfg.sub1d.orig
Config-General-2.31/t/sub1/cfg.sub1d
Config-General-2.31/t/sub1/cfg.sub1e.orig
Config-General-2.31/t/sub1/cfg.sub1e
Config-General-2.31/t/cfg.16
Config-General-2.31/t/cfg.17
Config-General-2.31/t/cfg.19
Config-General-2.31/t/cfg.2
Config-General-2.31/t/cfg.3
Config-General-2.31/t/cfg.4
Config-General-2.31/t/cfg.5
Config-General-2.31/t/cfg.6
Config-General-2.31/t/cfg.7
Config-General-2.31/t/cfg.8
Config-General-2.31/t/test.rc
Config-General-2.31/t/cfg.20.a
Config-General-2.31/t/cfg.20.b
Config-General-2.31/t/cfg.20.c
Config-General-2.31/t/run.t
Config-General-2.31/MANIFEST
Config-General-2.31/example.cfg
Config-General-2.31/Makefile.PL
Config-General-2.31/General.pm
Config-General-2.31/README
Config-General-2.31/Changelog
Config-General-2.31/Extended.pm

   CPAN.pm: Going to build T/TL/TLINDEN/Config-General-2.31.tar.gz

Checking if your kit is complete...
Looks good
Writing Makefile for Config::General
cp Extended.pm blib/lib/Config/Extended.pm
cp General.pm blib/lib/Config/General.pm
cp General/Interpolated.pm blib/lib/Config/General/Interpolated.pm
cp General/Extended.pm blib/lib/Config/General/Extended.pm
Manifying blib/man3/Config::Extended.3pm
Manifying blib/man3/Config::General.3pm
Manifying blib/man3/Config::General::Interpolated.3pm
Manifying blib/man3/Config::General::Extended.3pm
   /usr/bin/make  -- OK
Running make test
PERL_DL_NONLAZY=1 /usr/bin/perl "-MExtUtils::Command::MM" "-e" 
"test_harness(0, 'blib/lib', 'blib/arch')" t/*.t
t/run....ok 1/24 .. ok # loading Config::General 

t/run....ok 2/24 ... ok # Nested block test 

t/run....ok 3/24 ... ok # Array content test 

t/run....ok 4/24 ... ok # Here-document test 

  ... ok # Multiline option test
t/run....ok 5/24 ... ok # Comment test 

t/run....ok 6/24 ... ok # Case insensitive block test 

t/run....ok 7/24 ... ok # Writing Config Hash to disk and compare with 
original
t/run....ok 8/24 ... ok # Creating a new object from config file 

t/run....ok 9/24 ... ok # Creating a new object using the hash parameter 
way
t/run....ok 10/24 .. ok # Creating a new object from a block 

t/run....ok 11/24 .. ok # Creating a new object from a sub block 

t/run....ok 12/24 .. ok # Getting values from the object 

t/run....ok 13/24 .. ok # Using keys() and values() 

t/run....ok 14/24 .. ok # Using AUTOLOAD methods 

t/run....ok 15/24Useless use of concatenation (.) or string in void 
context at blib/lib/Config/General/Interpolated.pm line 94.
  .. ok # Testing variable interpolation
t/run....ok 16/24 .. ok # Testing value pre-setting using a hash 

t/run....ok 17/24 .. ok # Testing value pre-setting using a string 

t/run....ok 18/24 .. ok # Testing various otion/value assignment 
notations
t/run....ok 19/24 .. ok # testing files() method 

t/run....ok 20/24 .. ok # prevented from loading relative cfgs without 
-IncludeRelative
t/run....ok 21/24 .. ok # loaded relative to included files 

t/run....ok 22/2423 not ok 

  .. ok # including multiple files via glob pattern with -IncludeGlob
t/run....ok 23/24 .. ok # block and block name quoting 

t/run....ok 

All tests successful.
Files=1, Tests=24,  7 wallclock secs ( 0.09 cusr +  0.02 csys =  0.11 CPU)
   /usr/bin/make test -- OK
Running make install
Installing /Library/Perl/5.8.6/Config/Extended.pm
Installing /Library/Perl/5.8.6/Config/General.pm
Installing /Library/Perl/5.8.6/Config/General/Extended.pm
Installing /Library/Perl/5.8.6/Config/General/Interpolated.pm
Installing /usr/local/man/man3/Config::Extended.3pm
Installing /usr/local/man/man3/Config::General.3pm
Installing /usr/local/man/man3/Config::General::Extended.3pm
Installing /usr/local/man/man3/Config::General::Interpolated.3pm
Writing 
/Library/Perl/5.8.6/darwin-thread-multi-2level/auto/Config/General/.packlist
Appending installation info to 
//System/Library/Perl/5.8.6/darwin-thread-multi-2level/perllocal.pod
   /usr/bin/make install  -- OK
Running make for O/OL/OLIVIERT/LogValidator/W3C-LogValidator-1.06.tar.gz
   Is already unwrapped into directory 
/Users/elharo/.cpan/build/W3C-LogValidator-1.06

   CPAN.pm: Going to build 
O/OL/OLIVIERT/LogValidator/W3C-LogValidator-1.06.tar.gz

cp lib/W3C/LogValidator/SurveyEngine.pm 
blib/lib/W3C/LogValidator/SurveyEngine.pm
cp lib/W3C/LogValidator/LinkReferer.pm 
blib/lib/W3C/LogValidator/LinkReferer.pm
cp lib/W3C/LogValidator/Config.pm blib/lib/W3C/LogValidator/Config.pm
cp lib/W3C/LogValidator/Output/Mail.pm 
blib/lib/W3C/LogValidator/Output/Mail.pm
cp lib/W3C/LogValidator.pm blib/lib/W3C/LogValidator.pm
cp lib/W3C/LogValidator/LinkChecker.pm 
blib/lib/W3C/LogValidator/LinkChecker.pm
cp lib/W3C/LogValidator/Output/HTML.pm 
blib/lib/W3C/LogValidator/Output/HTML.pm
cp lib/W3C/LogValidator/CSSValidator.pm 
blib/lib/W3C/LogValidator/CSSValidator.pm
cp lib/W3C/LogValidator/Output/Raw.pm 
blib/lib/W3C/LogValidator/Output/Raw.pm
cp lib/W3C/LogValidator/HTMLValidator.pm 
blib/lib/W3C/LogValidator/HTMLValidator.pm
cp lib/W3C/LogValidator/Basic.pm blib/lib/W3C/LogValidator/Basic.pm
cp bin/logprocess.pl blib/script/logprocess.pl
/usr/bin/perl "-MExtUtils::MY" -e "MY->fixin(shift)" 
blib/script/logprocess.pl
Manifying blib/man3/W3C::LogValidator::SurveyEngine.3pm
Manifying blib/man3/W3C::LogValidator::Output::Mail.3pm
Manifying blib/man3/W3C::LogValidator::Config.3pm
Manifying blib/man3/W3C::LogValidator::LinkChecker.3pm
Manifying blib/man3/W3C::LogValidator.3pm
Manifying blib/man3/W3C::LogValidator::Output::HTML.3pm
Manifying blib/man3/W3C::LogValidator::CSSValidator.3pm
Manifying blib/man3/W3C::LogValidator::Output::Raw.3pm
Manifying blib/man3/W3C::LogValidator::HTMLValidator.3pm
Manifying blib/man3/W3C::LogValidator::Basic.3pm
   /usr/bin/make  -- OK
Running make test
PERL_DL_NONLAZY=1 /usr/bin/perl "-MExtUtils::Command::MM" "-e" 
"test_harness(0, 'blib/lib', 'blib/arch')" t/*.t
t/base................ok 

t/module-basic........ok 

t/module-css..........Can't locate WebService/Validator/CSS/W3C.pm in 
@INC (@INC contains: 
/Users/elharo/.cpan/build/W3C-LogValidator-1.06/blib/lib 
/Users/elharo/.cpan/build/W3C-LogValidator-1.06/blib/arch /sw/lib/perl5 
/sw/lib/perl5/darwin 
/System/Library/Perl/5.8.6/darwin-thread-multi-2level 
/System/Library/Perl/5.8.6/darwin-thread-multi-2level 
/System/Library/Perl/5.8.6 
/Library/Perl/5.8.6/darwin-thread-multi-2level 
/Library/Perl/5.8.6/darwin-thread-multi-2level /Library/Perl/5.8.6 
/Library/Perl/5.8.6/darwin-thread-multi-2level /Library/Perl/5.8.6 
/Library/Perl /Network/Library/Perl/5.8.6/darwin-thread-multi-2level 
/Network/Library/Perl/5.8.6 /Network/Library/Perl 
/System/Library/Perl/Extras/5.8.6/darwin-thread-multi-2level 
/System/Library/Perl/Extras/5.8.6/darwin-thread-multi-2level 
/System/Library/Perl/Extras/5.8.6 /Library/Perl/5.8.1 . 
/System/Library/Perl/5.8.6/darwin-thread-multi-2level 
/System/Library/Perl/5.8.6 
/Library/Perl/5.8.6/darwin-thread-multi-2level /Library/Perl/5.8.6 
/Library/Perl /Network/Library/Perl/5.8.6/darwin-thread-multi-2level 
/Network/Library/Perl/5.8.6 /Network/Library/Perl 
/System/Library/Perl/Extras/5.8.6/darwin-thread-multi-2level 
/System/Library/Perl/Extras/5.8.6 /Library/Perl/5.8.1 .) at 
/Users/elharo/.cpan/build/W3C-LogValidator-1.06/blib/lib/W3C/LogValidator/CSSValidator.pm 
line 12.
BEGIN failed--compilation aborted at 
/Users/elharo/.cpan/build/W3C-LogValidator-1.06/blib/lib/W3C/LogValidator/CSSValidator.pm 
line 12.
Compilation failed in require at t/module-css.t line 6.
BEGIN failed--compilation aborted at t/module-css.t line 6.
t/module-css..........dubious 

         Test returned status 2 (wstat 512, 0x200)
t/module-htmlval......Can't locate LWP/UserAgent.pm in @INC (@INC 
contains: /Users/elharo/.cpan/build/W3C-LogValidator-1.06/blib/lib 
/Users/elharo/.cpan/build/W3C-LogValidator-1.06/blib/arch /sw/lib/perl5 
/sw/lib/perl5/darwin 
/System/Library/Perl/5.8.6/darwin-thread-multi-2level 
/System/Library/Perl/5.8.6/darwin-thread-multi-2level 
/System/Library/Perl/5.8.6 
/Library/Perl/5.8.6/darwin-thread-multi-2level 
/Library/Perl/5.8.6/darwin-thread-multi-2level /Library/Perl/5.8.6 
/Library/Perl/5.8.6/darwin-thread-multi-2level /Library/Perl/5.8.6 
/Library/Perl /Network/Library/Perl/5.8.6/darwin-thread-multi-2level 
/Network/Library/Perl/5.8.6 /Network/Library/Perl 
/System/Library/Perl/Extras/5.8.6/darwin-thread-multi-2level 
/System/Library/Perl/Extras/5.8.6/darwin-thread-multi-2level 
/System/Library/Perl/Extras/5.8.6 /Library/Perl/5.8.1 . 
/System/Library/Perl/5.8.6/darwin-thread-multi-2level 
/System/Library/Perl/5.8.6 
/Library/Perl/5.8.6/darwin-thread-multi-2level /Library/Perl/5.8.6 
/Library/Perl /Network/Library/Perl/5.8.6/darwin-thread-multi-2level 
/Network/Library/Perl/5.8.6 /Network/Library/Perl 
/System/Library/Perl/Extras/5.8.6/darwin-thread-multi-2level 
/System/Library/Perl/Extras/5.8.6 /Library/Perl/5.8.1 .) at 
/Users/elharo/.cpan/build/W3C-LogValidator-1.06/blib/lib/W3C/LogValidator/HTMLValidator.pm 
line 118.
BEGIN failed--compilation aborted at 
/Users/elharo/.cpan/build/W3C-LogValidator-1.06/blib/lib/W3C/LogValidator/HTMLValidator.pm 
line 118.
Compilation failed in require at t/module-htmlval.t line 6.
BEGIN failed--compilation aborted at t/module-htmlval.t line 6.
t/module-htmlval......dubious 

         Test returned status 2 (wstat 512, 0x200)
t/module-linkcheck....ok 

t/module-survey.......Can't locate LWP/UserAgent.pm in @INC (@INC 
contains: /Users/elharo/.cpan/build/W3C-LogValidator-1.06/blib/lib 
/Users/elharo/.cpan/build/W3C-LogValidator-1.06/blib/arch /sw/lib/perl5 
/sw/lib/perl5/darwin 
/System/Library/Perl/5.8.6/darwin-thread-multi-2level 
/System/Library/Perl/5.8.6/darwin-thread-multi-2level 
/System/Library/Perl/5.8.6 
/Library/Perl/5.8.6/darwin-thread-multi-2level 
/Library/Perl/5.8.6/darwin-thread-multi-2level /Library/Perl/5.8.6 
/Library/Perl/5.8.6/darwin-thread-multi-2level /Library/Perl/5.8.6 
/Library/Perl /Network/Library/Perl/5.8.6/darwin-thread-multi-2level 
/Network/Library/Perl/5.8.6 /Network/Library/Perl 
/System/Library/Perl/Extras/5.8.6/darwin-thread-multi-2level 
/System/Library/Perl/Extras/5.8.6/darwin-thread-multi-2level 
/System/Library/Perl/Extras/5.8.6 /Library/Perl/5.8.1 . 
/System/Library/Perl/5.8.6/darwin-thread-multi-2level 
/System/Library/Perl/5.8.6 
/Library/Perl/5.8.6/darwin-thread-multi-2level /Library/Perl/5.8.6 
/Library/Perl /Network/Library/Perl/5.8.6/darwin-thread-multi-2level 
/Network/Library/Perl/5.8.6 /Network/Library/Perl 
/System/Library/Perl/Extras/5.8.6/darwin-thread-multi-2level 
/System/Library/Perl/Extras/5.8.6 /Library/Perl/5.8.1 .) at 
/Users/elharo/.cpan/build/W3C-LogValidator-1.06/blib/lib/W3C/LogValidator/SurveyEngine.pm 
line 144.
BEGIN failed--compilation aborted at 
/Users/elharo/.cpan/build/W3C-LogValidator-1.06/blib/lib/W3C/LogValidator/SurveyEngine.pm 
line 144.
Compilation failed in require at t/module-survey.t line 6.
BEGIN failed--compilation aborted at t/module-survey.t line 6.
t/module-survey.......dubious 

         Test returned status 2 (wstat 512, 0x200)
Failed Test        Stat Wstat Total Fail  Failed  List of Failed
-------------------------------------------------------------------------------
t/module-css.t        2   512    ??   ??       %  ??
t/module-htmlval.t    2   512    ??   ??       %  ??
t/module-survey.t     2   512    ??   ??       %  ??
Failed 3/6 test scripts, 50.00% okay. 0/10 subtests failed, 100.00% okay.
make: *** [test_dynamic] Error 2
   /usr/bin/make test -- NOT OK
Running make install
   make test had returned bad status, won't install without force

 
          cpan>


-- 
´╗┐Elliotte Rusty Harold  elharo@metalab.unc.edu
Java I/O 2nd Edition Just Published!
http://www.cafeaulait.org/books/javaio2/
http://www.amazon.com/exec/obidos/ISBN=0596527500/ref=nosim/cafeaulaitA/
Received on Thursday, 1 February 2007 19:54:18 GMT

This archive was generated by hypermail 2.2.0+W3C-0.50 : Wednesday, 25 April 2012 12:14:23 GMT