W3C home > Mailing lists > Public > www-dom-ts@w3.org > June 2002

Testing dom1-html.jar

From: Curt Arnold <carnold@houston.rr.com>
Date: Tue, 4 Jun 2002 21:05:17 -0500
Message-ID: <001b01c20c35$704b0580$a800a8c0@CurtMicron>
To: <www-dom-ts@w3.org>
I've just run dom1-html.jar with a modified versions of Xerces-J (patches attached).  Quite a few tests failed since supporting test files were missing, specifically collection.xml, frame.xml, frameset.xml, and iframe.xml (the HTML versions are also missing).  

I haven't investigated the other failures.  They may or may not be problems with the tests.

D:\domts\2001\DOM-Test-Suite\build>java -cp dom1-html.jar junit.textui.TestRunne
r org.w3c.domts.level1.html.TestXercesHTML
.................F..F........F..............
.........E.E.E.E.E.E.E.E.E.E.E.E.....F.F.F..F.F.F.F.F.F.F......
.......................F..................
...........F.............................F.
............................F.............
.....................E........E.E.E.E.E.E.E.E.E.E..F.
F.F.F.F.F.....F.E.E.E.E.E.E.E.E.E.E.............F.F........
...............................E..........
.........................F.....F...........
....F...F....E..............................
......................E..E..E...............
F.F..F.F.E.F.F.E.E.E.E.E.E.F..........E.E.E.E..............
...........F..........F.F...
Time: 451.869
There were 49 errors:
1) http://www.w3.org/2001/DOM-Test-Suite/level1/html/HTMLCollection01(org.w3c.do
mts.JUnitTestCaseAdapter)
java.io.FileNotFoundException: D:\domts\2001\DOM-Test-Suite\build\tests\level1\h
tml\files\collection.xml (The system cannot find the path specified)
        at org.w3c.domts.XercesHTMLDocumentBuilderFactory.load(XercesHTMLDocumen
tBuilderFactory.java:205)
        at org.w3c.domts.DOMTest.load(DOMTest.java:113)
        at org.w3c.domts.level1.html.HTMLCollection01.runTest(HTMLCollection01.j
ava:64)
        at org.w3c.domts.JUnitTestCaseAdapter.runTest(JUnitTestCaseAdapter.java:
53)
2) http://www.w3.org/2001/DOM-Test-Suite/level1/html/HTMLCollection02(org.w3c.do
mts.JUnitTestCaseAdapter)
java.io.FileNotFoundException: D:\domts\2001\DOM-Test-Suite\build\tests\level1\h
tml\files\collection.xml (The system cannot find the path specified)
        at org.w3c.domts.XercesHTMLDocumentBuilderFactory.load(XercesHTMLDocumen
tBuilderFactory.java:205)
        at org.w3c.domts.DOMTest.load(DOMTest.java:113)
        at org.w3c.domts.level1.html.HTMLCollection02.runTest(HTMLCollection02.j
ava:64)
        at org.w3c.domts.JUnitTestCaseAdapter.runTest(JUnitTestCaseAdapter.java:
53)
3) http://www.w3.org/2001/DOM-Test-Suite/level1/html/HTMLCollection03(org.w3c.do
mts.JUnitTestCaseAdapter)
java.io.FileNotFoundException: D:\domts\2001\DOM-Test-Suite\build\tests\level1\h
tml\files\collection.xml (The system cannot find the path specified)
        at org.w3c.domts.XercesHTMLDocumentBuilderFactory.load(XercesHTMLDocumen
tBuilderFactory.java:205)
        at org.w3c.domts.DOMTest.load(DOMTest.java:113)
        at org.w3c.domts.level1.html.HTMLCollection03.runTest(HTMLCollection03.j
ava:64)
        at org.w3c.domts.JUnitTestCaseAdapter.runTest(JUnitTestCaseAdapter.java:
53)
4) http://www.w3.org/2001/DOM-Test-Suite/level1/html/HTMLCollection04(org.w3c.do
mts.JUnitTestCaseAdapter)
java.io.FileNotFoundException: D:\domts\2001\DOM-Test-Suite\build\tests\level1\h
tml\files\collection.xml (The system cannot find the path specified)
        at org.w3c.domts.XercesHTMLDocumentBuilderFactory.load(XercesHTMLDocumen
tBuilderFactory.java:205)
        at org.w3c.domts.DOMTest.load(DOMTest.java:113)
        at org.w3c.domts.level1.html.HTMLCollection04.runTest(HTMLCollection04.j
ava:72)
        at org.w3c.domts.JUnitTestCaseAdapter.runTest(JUnitTestCaseAdapter.java:
53)
5) http://www.w3.org/2001/DOM-Test-Suite/level1/html/HTMLCollection05(org.w3c.do
mts.JUnitTestCaseAdapter)
java.io.FileNotFoundException: D:\domts\2001\DOM-Test-Suite\build\tests\level1\h
tml\files\collection.xml (The system cannot find the path specified)
        at org.w3c.domts.XercesHTMLDocumentBuilderFactory.load(XercesHTMLDocumen
tBuilderFactory.java:205)
        at org.w3c.domts.DOMTest.load(DOMTest.java:113)
        at org.w3c.domts.level1.html.HTMLCollection05.runTest(HTMLCollection05.j
ava:62)
        at org.w3c.domts.JUnitTestCaseAdapter.runTest(JUnitTestCaseAdapter.java:
53)
6) http://www.w3.org/2001/DOM-Test-Suite/level1/html/HTMLCollection06(org.w3c.do
mts.JUnitTestCaseAdapter)
java.io.FileNotFoundException: D:\domts\2001\DOM-Test-Suite\build\tests\level1\h
tml\files\collection.xml (The system cannot find the path specified)
        at org.w3c.domts.XercesHTMLDocumentBuilderFactory.load(XercesHTMLDocumen
tBuilderFactory.java:205)
        at org.w3c.domts.DOMTest.load(DOMTest.java:113)
        at org.w3c.domts.level1.html.HTMLCollection06.runTest(HTMLCollection06.j
ava:64)
        at org.w3c.domts.JUnitTestCaseAdapter.runTest(JUnitTestCaseAdapter.java:
53)
7) http://www.w3.org/2001/DOM-Test-Suite/level1/html/HTMLCollection07(org.w3c.do
mts.JUnitTestCaseAdapter)
java.io.FileNotFoundException: D:\domts\2001\DOM-Test-Suite\build\tests\level1\h
tml\files\collection.xml (The system cannot find the path specified)
        at org.w3c.domts.XercesHTMLDocumentBuilderFactory.load(XercesHTMLDocumen
tBuilderFactory.java:205)
        at org.w3c.domts.DOMTest.load(DOMTest.java:113)
        at org.w3c.domts.level1.html.HTMLCollection07.runTest(HTMLCollection07.j
ava:64)
        at org.w3c.domts.JUnitTestCaseAdapter.runTest(JUnitTestCaseAdapter.java:
53)
8) http://www.w3.org/2001/DOM-Test-Suite/level1/html/HTMLCollection08(org.w3c.do
mts.JUnitTestCaseAdapter)
java.io.FileNotFoundException: D:\domts\2001\DOM-Test-Suite\build\tests\level1\h
tml\files\collection.xml (The system cannot find the path specified)
        at org.w3c.domts.XercesHTMLDocumentBuilderFactory.load(XercesHTMLDocumen
tBuilderFactory.java:205)
        at org.w3c.domts.DOMTest.load(DOMTest.java:113)
        at org.w3c.domts.level1.html.HTMLCollection08.runTest(HTMLCollection08.j
ava:64)
        at org.w3c.domts.JUnitTestCaseAdapter.runTest(JUnitTestCaseAdapter.java:
53)
9) http://www.w3.org/2001/DOM-Test-Suite/level1/html/HTMLCollection09(org.w3c.do
mts.JUnitTestCaseAdapter)
java.io.FileNotFoundException: D:\domts\2001\DOM-Test-Suite\build\tests\level1\h
tml\files\collection.xml (The system cannot find the path specified)
        at org.w3c.domts.XercesHTMLDocumentBuilderFactory.load(XercesHTMLDocumen
tBuilderFactory.java:205)
        at org.w3c.domts.DOMTest.load(DOMTest.java:113)
        at org.w3c.domts.level1.html.HTMLCollection09.runTest(HTMLCollection09.j
ava:63)
        at org.w3c.domts.JUnitTestCaseAdapter.runTest(JUnitTestCaseAdapter.java:
53)
10) http://www.w3.org/2001/DOM-Test-Suite/level1/html/HTMLCollection10(org.w3c.d
omts.JUnitTestCaseAdapter)
java.io.FileNotFoundException: D:\domts\2001\DOM-Test-Suite\build\tests\level1\h
tml\files\collection.xml (The system cannot find the path specified)
        at org.w3c.domts.XercesHTMLDocumentBuilderFactory.load(XercesHTMLDocumen
tBuilderFactory.java:205)
        at org.w3c.domts.DOMTest.load(DOMTest.java:113)
        at org.w3c.domts.level1.html.HTMLCollection10.runTest(HTMLCollection10.j
ava:66)
        at org.w3c.domts.JUnitTestCaseAdapter.runTest(JUnitTestCaseAdapter.java:
53)
11) http://www.w3.org/2001/DOM-Test-Suite/level1/html/HTMLCollection11(org.w3c.d
omts.JUnitTestCaseAdapter)
java.io.FileNotFoundException: D:\domts\2001\DOM-Test-Suite\build\tests\level1\h
tml\files\collection.xml (The system cannot find the path specified)
        at org.w3c.domts.XercesHTMLDocumentBuilderFactory.load(XercesHTMLDocumen
tBuilderFactory.java:205)
        at org.w3c.domts.DOMTest.load(DOMTest.java:113)
        at org.w3c.domts.level1.html.HTMLCollection11.runTest(HTMLCollection11.j
ava:66)
        at org.w3c.domts.JUnitTestCaseAdapter.runTest(JUnitTestCaseAdapter.java:
53)
12) http://www.w3.org/2001/DOM-Test-Suite/level1/html/HTMLCollection12(org.w3c.d
omts.JUnitTestCaseAdapter)
java.io.FileNotFoundException: D:\domts\2001\DOM-Test-Suite\build\tests\level1\h
tml\files\collection.xml (The system cannot find the path specified)
        at org.w3c.domts.XercesHTMLDocumentBuilderFactory.load(XercesHTMLDocumen
tBuilderFactory.java:205)
        at org.w3c.domts.DOMTest.load(DOMTest.java:113)
        at org.w3c.domts.level1.html.HTMLCollection12.runTest(HTMLCollection12.j
ava:66)
        at org.w3c.domts.JUnitTestCaseAdapter.runTest(JUnitTestCaseAdapter.java:
53)
13) http://www.w3.org/2001/DOM-Test-Suite/level1/html/HTMLFormElement01(org.w3c.
domts.JUnitTestCaseAdapter)
java.lang.ClassCastException: org.apache.html.dom.HTMLCollectionImpl
        at org.w3c.domts.level1.html.HTMLFormElement01.runTest(HTMLFormElement01
.java:83)
        at org.w3c.domts.JUnitTestCaseAdapter.runTest(JUnitTestCaseAdapter.java:
53)
14) http://www.w3.org/2001/DOM-Test-Suite/level1/html/HTMLFrameElement01(org.w3c
.domts.JUnitTestCaseAdapter)
java.io.FileNotFoundException: D:\domts\2001\DOM-Test-Suite\build\tests\level1\h
tml\files\frame.xml (The system cannot find the path specified)
        at org.w3c.domts.XercesHTMLDocumentBuilderFactory.load(XercesHTMLDocumen
tBuilderFactory.java:205)
        at org.w3c.domts.DOMTest.load(DOMTest.java:113)
        at org.w3c.domts.level1.html.HTMLFrameElement01.runTest(HTMLFrameElement
01.java:62)
        at org.w3c.domts.JUnitTestCaseAdapter.runTest(JUnitTestCaseAdapter.java:
53)
15) http://www.w3.org/2001/DOM-Test-Suite/level1/html/HTMLFrameElement02(org.w3c
.domts.JUnitTestCaseAdapter)
java.io.FileNotFoundException: D:\domts\2001\DOM-Test-Suite\build\tests\level1\h
tml\files\frame.xml (The system cannot find the path specified)
        at org.w3c.domts.XercesHTMLDocumentBuilderFactory.load(XercesHTMLDocumen
tBuilderFactory.java:205)
        at org.w3c.domts.DOMTest.load(DOMTest.java:113)
        at org.w3c.domts.level1.html.HTMLFrameElement02.runTest(HTMLFrameElement
02.java:61)
        at org.w3c.domts.JUnitTestCaseAdapter.runTest(JUnitTestCaseAdapter.java:
53)
16) http://www.w3.org/2001/DOM-Test-Suite/level1/html/HTMLFrameElement03(org.w3c
.domts.JUnitTestCaseAdapter)
java.io.FileNotFoundException: D:\domts\2001\DOM-Test-Suite\build\tests\level1\h
tml\files\frame.xml (The system cannot find the path specified)
        at org.w3c.domts.XercesHTMLDocumentBuilderFactory.load(XercesHTMLDocumen
tBuilderFactory.java:205)
        at org.w3c.domts.DOMTest.load(DOMTest.java:113)
        at org.w3c.domts.level1.html.HTMLFrameElement03.runTest(HTMLFrameElement
03.java:60)
        at org.w3c.domts.JUnitTestCaseAdapter.runTest(JUnitTestCaseAdapter.java:
53)
17) http://www.w3.org/2001/DOM-Test-Suite/level1/html/HTMLFrameElement04(org.w3c
.domts.JUnitTestCaseAdapter)
java.io.FileNotFoundException: D:\domts\2001\DOM-Test-Suite\build\tests\level1\h
tml\files\frame.xml (The system cannot find the path specified)
        at org.w3c.domts.XercesHTMLDocumentBuilderFactory.load(XercesHTMLDocumen
tBuilderFactory.java:205)
        at org.w3c.domts.DOMTest.load(DOMTest.java:113)
        at org.w3c.domts.level1.html.HTMLFrameElement04.runTest(HTMLFrameElement
04.java:60)
        at org.w3c.domts.JUnitTestCaseAdapter.runTest(JUnitTestCaseAdapter.java:
53)
18) http://www.w3.org/2001/DOM-Test-Suite/level1/html/HTMLFrameElement05(org.w3c
.domts.JUnitTestCaseAdapter)
java.io.FileNotFoundException: D:\domts\2001\DOM-Test-Suite\build\tests\level1\h
tml\files\frame.xml (The system cannot find the path specified)
        at org.w3c.domts.XercesHTMLDocumentBuilderFactory.load(XercesHTMLDocumen
tBuilderFactory.java:205)
        at org.w3c.domts.DOMTest.load(DOMTest.java:113)
        at org.w3c.domts.level1.html.HTMLFrameElement05.runTest(HTMLFrameElement
05.java:61)
        at org.w3c.domts.JUnitTestCaseAdapter.runTest(JUnitTestCaseAdapter.java:
53)
19) http://www.w3.org/2001/DOM-Test-Suite/level1/html/HTMLFrameElement06(org.w3c
.domts.JUnitTestCaseAdapter)
java.io.FileNotFoundException: D:\domts\2001\DOM-Test-Suite\build\tests\level1\h
tml\files\frame.xml (The system cannot find the path specified)
        at org.w3c.domts.XercesHTMLDocumentBuilderFactory.load(XercesHTMLDocumen
tBuilderFactory.java:205)
        at org.w3c.domts.DOMTest.load(DOMTest.java:113)
        at org.w3c.domts.level1.html.HTMLFrameElement06.runTest(HTMLFrameElement
06.java:61)
        at org.w3c.domts.JUnitTestCaseAdapter.runTest(JUnitTestCaseAdapter.java:
53)
20) http://www.w3.org/2001/DOM-Test-Suite/level1/html/HTMLFrameElement07(org.w3c
.domts.JUnitTestCaseAdapter)
java.io.FileNotFoundException: D:\domts\2001\DOM-Test-Suite\build\tests\level1\h
tml\files\frame.xml (The system cannot find the path specified)
        at org.w3c.domts.XercesHTMLDocumentBuilderFactory.load(XercesHTMLDocumen
tBuilderFactory.java:205)
        at org.w3c.domts.DOMTest.load(DOMTest.java:113)
        at org.w3c.domts.level1.html.HTMLFrameElement07.runTest(HTMLFrameElement
07.java:61)
        at org.w3c.domts.JUnitTestCaseAdapter.runTest(JUnitTestCaseAdapter.java:
53)
21) http://www.w3.org/2001/DOM-Test-Suite/level1/html/HTMLFrameElement08(org.w3c
.domts.JUnitTestCaseAdapter)
java.io.FileNotFoundException: D:\domts\2001\DOM-Test-Suite\build\tests\level1\h
tml\files\frame.xml (The system cannot find the path specified)
        at org.w3c.domts.XercesHTMLDocumentBuilderFactory.load(XercesHTMLDocumen
tBuilderFactory.java:205)
        at org.w3c.domts.DOMTest.load(DOMTest.java:113)
        at org.w3c.domts.level1.html.HTMLFrameElement08.runTest(HTMLFrameElement
08.java:60)
        at org.w3c.domts.JUnitTestCaseAdapter.runTest(JUnitTestCaseAdapter.java:
53)
22) http://www.w3.org/2001/DOM-Test-Suite/level1/html/HTMLFrameSetElement01(org.
w3c.domts.JUnitTestCaseAdapter)
java.io.FileNotFoundException: D:\domts\2001\DOM-Test-Suite\build\tests\level1\h
tml\files\frameset.xml (The system cannot find the path specified)
        at org.w3c.domts.XercesHTMLDocumentBuilderFactory.load(XercesHTMLDocumen
tBuilderFactory.java:205)
        at org.w3c.domts.DOMTest.load(DOMTest.java:113)
        at org.w3c.domts.level1.html.HTMLFrameSetElement01.runTest(HTMLFrameSetE
lement01.java:61)
        at org.w3c.domts.JUnitTestCaseAdapter.runTest(JUnitTestCaseAdapter.java:
53)
23) http://www.w3.org/2001/DOM-Test-Suite/level1/html/HTMLFrameSetElement02(org.
w3c.domts.JUnitTestCaseAdapter)
java.io.FileNotFoundException: D:\domts\2001\DOM-Test-Suite\build\tests\level1\h
tml\files\frameset.xml (The system cannot find the path specified)
        at org.w3c.domts.XercesHTMLDocumentBuilderFactory.load(XercesHTMLDocumen
tBuilderFactory.java:205)
        at org.w3c.domts.DOMTest.load(DOMTest.java:113)
        at org.w3c.domts.level1.html.HTMLFrameSetElement02.runTest(HTMLFrameSetE
lement02.java:61)
        at org.w3c.domts.JUnitTestCaseAdapter.runTest(JUnitTestCaseAdapter.java:
53)
24) http://www.w3.org/2001/DOM-Test-Suite/level1/html/HTMLIFrameElement01(org.w3
c.domts.JUnitTestCaseAdapter)
java.io.FileNotFoundException: D:\domts\2001\DOM-Test-Suite\build\tests\level1\h
tml\files\iframe.xml (The system cannot find the path specified)
        at org.w3c.domts.XercesHTMLDocumentBuilderFactory.load(XercesHTMLDocumen
tBuilderFactory.java:205)
        at org.w3c.domts.DOMTest.load(DOMTest.java:113)
        at org.w3c.domts.level1.html.HTMLIFrameElement01.runTest(HTMLIFrameEleme
nt01.java:61)
        at org.w3c.domts.JUnitTestCaseAdapter.runTest(JUnitTestCaseAdapter.java:
53)
25) http://www.w3.org/2001/DOM-Test-Suite/level1/html/HTMLIFrameElement02(org.w3
c.domts.JUnitTestCaseAdapter)
java.io.FileNotFoundException: D:\domts\2001\DOM-Test-Suite\build\tests\level1\h
tml\files\iframe.xml (The system cannot find the path specified)
        at org.w3c.domts.XercesHTMLDocumentBuilderFactory.load(XercesHTMLDocumen
tBuilderFactory.java:205)
        at org.w3c.domts.DOMTest.load(DOMTest.java:113)
        at org.w3c.domts.level1.html.HTMLIFrameElement02.runTest(HTMLIFrameEleme
nt02.java:62)
        at org.w3c.domts.JUnitTestCaseAdapter.runTest(JUnitTestCaseAdapter.java:
53)
26) http://www.w3.org/2001/DOM-Test-Suite/level1/html/HTMLIFrameElement03(org.w3
c.domts.JUnitTestCaseAdapter)
java.io.FileNotFoundException: D:\domts\2001\DOM-Test-Suite\build\tests\level1\h
tml\files\iframe.xml (The system cannot find the path specified)
        at org.w3c.domts.XercesHTMLDocumentBuilderFactory.load(XercesHTMLDocumen
tBuilderFactory.java:205)
        at org.w3c.domts.DOMTest.load(DOMTest.java:113)
        at org.w3c.domts.level1.html.HTMLIFrameElement03.runTest(HTMLIFrameEleme
nt03.java:60)
        at org.w3c.domts.JUnitTestCaseAdapter.runTest(JUnitTestCaseAdapter.java:
53)
27) http://www.w3.org/2001/DOM-Test-Suite/level1/html/HTMLIFrameElement04(org.w3
c.domts.JUnitTestCaseAdapter)
java.io.FileNotFoundException: D:\domts\2001\DOM-Test-Suite\build\tests\level1\h
tml\files\iframe.xml (The system cannot find the path specified)
        at org.w3c.domts.XercesHTMLDocumentBuilderFactory.load(XercesHTMLDocumen
tBuilderFactory.java:205)
        at org.w3c.domts.DOMTest.load(DOMTest.java:113)
        at org.w3c.domts.level1.html.HTMLIFrameElement04.runTest(HTMLIFrameEleme
nt04.java:61)
        at org.w3c.domts.JUnitTestCaseAdapter.runTest(JUnitTestCaseAdapter.java:
53)
28) http://www.w3.org/2001/DOM-Test-Suite/level1/html/HTMLIFrameElement05(org.w3
c.domts.JUnitTestCaseAdapter)
java.io.FileNotFoundException: D:\domts\2001\DOM-Test-Suite\build\tests\level1\h
tml\files\iframe.xml (The system cannot find the path specified)
        at org.w3c.domts.XercesHTMLDocumentBuilderFactory.load(XercesHTMLDocumen
tBuilderFactory.java:205)
        at org.w3c.domts.DOMTest.load(DOMTest.java:113)
        at org.w3c.domts.level1.html.HTMLIFrameElement05.runTest(HTMLIFrameEleme
nt05.java:60)
        at org.w3c.domts.JUnitTestCaseAdapter.runTest(JUnitTestCaseAdapter.java:
53)
29) http://www.w3.org/2001/DOM-Test-Suite/level1/html/HTMLIFrameElement06(org.w3
c.domts.JUnitTestCaseAdapter)
java.io.FileNotFoundException: D:\domts\2001\DOM-Test-Suite\build\tests\level1\h
tml\files\iframe.xml (The system cannot find the path specified)
        at org.w3c.domts.XercesHTMLDocumentBuilderFactory.load(XercesHTMLDocumen
tBuilderFactory.java:205)
        at org.w3c.domts.DOMTest.load(DOMTest.java:113)
        at org.w3c.domts.level1.html.HTMLIFrameElement06.runTest(HTMLIFrameEleme
nt06.java:60)
        at org.w3c.domts.JUnitTestCaseAdapter.runTest(JUnitTestCaseAdapter.java:
53)
30) http://www.w3.org/2001/DOM-Test-Suite/level1/html/HTMLIFrameElement07(org.w3
c.domts.JUnitTestCaseAdapter)
java.io.FileNotFoundException: D:\domts\2001\DOM-Test-Suite\build\tests\level1\h
tml\files\iframe.xml (The system cannot find the path specified)
        at org.w3c.domts.XercesHTMLDocumentBuilderFactory.load(XercesHTMLDocumen
tBuilderFactory.java:205)
        at org.w3c.domts.DOMTest.load(DOMTest.java:113)
        at org.w3c.domts.level1.html.HTMLIFrameElement07.runTest(HTMLIFrameEleme
nt07.java:61)
        at org.w3c.domts.JUnitTestCaseAdapter.runTest(JUnitTestCaseAdapter.java:
53)
31) http://www.w3.org/2001/DOM-Test-Suite/level1/html/HTMLIFrameElement08(org.w3
c.domts.JUnitTestCaseAdapter)
java.io.FileNotFoundException: D:\domts\2001\DOM-Test-Suite\build\tests\level1\h
tml\files\iframe.xml (The system cannot find the path specified)
        at org.w3c.domts.XercesHTMLDocumentBuilderFactory.load(XercesHTMLDocumen
tBuilderFactory.java:205)
        at org.w3c.domts.DOMTest.load(DOMTest.java:113)
        at org.w3c.domts.level1.html.HTMLIFrameElement08.runTest(HTMLIFrameEleme
nt08.java:61)
        at org.w3c.domts.JUnitTestCaseAdapter.runTest(JUnitTestCaseAdapter.java:
53)
32) http://www.w3.org/2001/DOM-Test-Suite/level1/html/HTMLIFrameElement09(org.w3
c.domts.JUnitTestCaseAdapter)
java.io.FileNotFoundException: D:\domts\2001\DOM-Test-Suite\build\tests\level1\h
tml\files\iframe.xml (The system cannot find the path specified)
        at org.w3c.domts.XercesHTMLDocumentBuilderFactory.load(XercesHTMLDocumen
tBuilderFactory.java:205)
        at org.w3c.domts.DOMTest.load(DOMTest.java:113)
        at org.w3c.domts.level1.html.HTMLIFrameElement09.runTest(HTMLIFrameEleme
nt09.java:60)
        at org.w3c.domts.JUnitTestCaseAdapter.runTest(JUnitTestCaseAdapter.java:
53)
33) http://www.w3.org/2001/DOM-Test-Suite/level1/html/HTMLIFrameElement10(org.w3
c.domts.JUnitTestCaseAdapter)
java.io.FileNotFoundException: D:\domts\2001\DOM-Test-Suite\build\tests\level1\h
tml\files\iframe.xml (The system cannot find the path specified)
        at org.w3c.domts.XercesHTMLDocumentBuilderFactory.load(XercesHTMLDocumen
tBuilderFactory.java:205)
        at org.w3c.domts.DOMTest.load(DOMTest.java:113)
        at org.w3c.domts.level1.html.HTMLIFrameElement10.runTest(HTMLIFrameEleme
nt10.java:60)
        at org.w3c.domts.JUnitTestCaseAdapter.runTest(JUnitTestCaseAdapter.java:
53)
34) http://www.w3.org/2001/DOM-Test-Suite/level1/html/HTMLMapElement01(org.w3c.d
omts.JUnitTestCaseAdapter)
java.lang.ClassCastException: org.apache.html.dom.HTMLCollectionImpl
        at org.w3c.domts.level1.html.HTMLMapElement01.runTest(HTMLMapElement01.j
ava:81)
        at org.w3c.domts.JUnitTestCaseAdapter.runTest(JUnitTestCaseAdapter.java:
53)
35) http://www.w3.org/2001/DOM-Test-Suite/level1/html/HTMLSelectElement08(org.w3
c.domts.JUnitTestCaseAdapter)
java.lang.ClassCastException: org.apache.html.dom.HTMLCollectionImpl
        at org.w3c.domts.level1.html.HTMLSelectElement08.runTest(HTMLSelectEleme
nt08.java:96)
        at org.w3c.domts.JUnitTestCaseAdapter.runTest(JUnitTestCaseAdapter.java:
53)
36) http://www.w3.org/2001/DOM-Test-Suite/level1/html/HTMLTableElement01(org.w3c
.domts.JUnitTestCaseAdapter)
java.lang.NullPointerException
        at org.w3c.domts.level1.html.HTMLTableElement01.runTest(HTMLTableElement
01.java:84)
        at org.w3c.domts.JUnitTestCaseAdapter.runTest(JUnitTestCaseAdapter.java:
53)
37) http://www.w3.org/2001/DOM-Test-Suite/level1/html/HTMLTableElement03(org.w3c
.domts.JUnitTestCaseAdapter)
java.lang.NullPointerException
        at org.w3c.domts.level1.html.HTMLTableElement03.runTest(HTMLTableElement
03.java:84)
        at org.w3c.domts.JUnitTestCaseAdapter.runTest(JUnitTestCaseAdapter.java:
53)
38) http://www.w3.org/2001/DOM-Test-Suite/level1/html/HTMLTableElement05(org.w3c
.domts.JUnitTestCaseAdapter)
java.lang.NullPointerException
        at org.w3c.domts.level1.html.HTMLTableElement05.runTest(HTMLTableElement
05.java:84)
        at org.w3c.domts.JUnitTestCaseAdapter.runTest(JUnitTestCaseAdapter.java:
53)
39) http://www.w3.org/2001/DOM-Test-Suite/level1/html/HTMLTableElement25(org.w3c
.domts.JUnitTestCaseAdapter)
java.lang.ClassCastException: org.apache.html.dom.HTMLTableCaptionElementImpl
        at org.w3c.domts.level1.html.HTMLTableElement25.runTest(HTMLTableElement
25.java:70)
        at org.w3c.domts.JUnitTestCaseAdapter.runTest(JUnitTestCaseAdapter.java:
53)
40) http://www.w3.org/2001/DOM-Test-Suite/level1/html/HTMLTableElement28(org.w3c
.domts.JUnitTestCaseAdapter)
java.lang.NullPointerException
        at org.w3c.domts.level1.html.HTMLTableElement28.runTest(HTMLTableElement
28.java:72)
        at org.w3c.domts.JUnitTestCaseAdapter.runTest(JUnitTestCaseAdapter.java:
53)
41) http://www.w3.org/2001/DOM-Test-Suite/level1/html/HTMLTableElement29(org.w3c
.domts.JUnitTestCaseAdapter)
java.lang.ClassCastException: org.apache.html.dom.HTMLCollectionImpl
        at org.w3c.domts.level1.html.HTMLTableElement29.runTest(HTMLTableElement
29.java:74)
        at org.w3c.domts.JUnitTestCaseAdapter.runTest(JUnitTestCaseAdapter.java:
53)
42) http://www.w3.org/2001/DOM-Test-Suite/level1/html/HTMLTableElement30(org.w3c
.domts.JUnitTestCaseAdapter)
java.lang.ClassCastException: org.apache.html.dom.HTMLTableElementImpl
        at org.w3c.domts.level1.html.HTMLTableElement30.runTest(HTMLTableElement
30.java:72)
        at org.w3c.domts.JUnitTestCaseAdapter.runTest(JUnitTestCaseAdapter.java:
53)
43) http://www.w3.org/2001/DOM-Test-Suite/level1/html/HTMLTableElement31(org.w3c
.domts.JUnitTestCaseAdapter)
java.lang.ClassCastException: org.apache.html.dom.HTMLCollectionImpl
        at org.w3c.domts.level1.html.HTMLTableElement31.runTest(HTMLTableElement
31.java:75)
        at org.w3c.domts.JUnitTestCaseAdapter.runTest(JUnitTestCaseAdapter.java:
53)
44) http://www.w3.org/2001/DOM-Test-Suite/level1/html/HTMLTableElement32(org.w3c
.domts.JUnitTestCaseAdapter)
java.lang.ClassCastException: org.apache.html.dom.HTMLTableElementImpl
        at org.w3c.domts.level1.html.HTMLTableElement32.runTest(HTMLTableElement
32.java:67)
        at org.w3c.domts.JUnitTestCaseAdapter.runTest(JUnitTestCaseAdapter.java:
53)
45) http://www.w3.org/2001/DOM-Test-Suite/level1/html/HTMLTableElement33(org.w3c
.domts.JUnitTestCaseAdapter)
java.lang.ClassCastException: org.apache.html.dom.HTMLTableElementImpl
        at org.w3c.domts.level1.html.HTMLTableElement33.runTest(HTMLTableElement
33.java:66)
        at org.w3c.domts.JUnitTestCaseAdapter.runTest(JUnitTestCaseAdapter.java:
53)
46) http://www.w3.org/2001/DOM-Test-Suite/level1/html/HTMLTableRowElement11(org.
w3c.domts.JUnitTestCaseAdapter)
java.lang.ClassCastException: org.apache.html.dom.HTMLCollectionImpl
        at org.w3c.domts.level1.html.HTMLTableRowElement11.runTest(HTMLTableRowE
lement11.java:78)
        at org.w3c.domts.JUnitTestCaseAdapter.runTest(JUnitTestCaseAdapter.java:
53)
47) http://www.w3.org/2001/DOM-Test-Suite/level1/html/HTMLTableRowElement12(org.
w3c.domts.JUnitTestCaseAdapter)
java.lang.ClassCastException: org.apache.html.dom.HTMLCollectionImpl
        at org.w3c.domts.level1.html.HTMLTableRowElement12.runTest(HTMLTableRowE
lement12.java:77)
        at org.w3c.domts.JUnitTestCaseAdapter.runTest(JUnitTestCaseAdapter.java:
53)
48) http://www.w3.org/2001/DOM-Test-Suite/level1/html/HTMLTableRowElement13(org.
w3c.domts.JUnitTestCaseAdapter)
java.lang.ClassCastException: org.apache.html.dom.HTMLCollectionImpl
        at org.w3c.domts.level1.html.HTMLTableRowElement13.runTest(HTMLTableRowE
lement13.java:76)
        at org.w3c.domts.JUnitTestCaseAdapter.runTest(JUnitTestCaseAdapter.java:
53)
49) http://www.w3.org/2001/DOM-Test-Suite/level1/html/HTMLTableRowElement14(org.
w3c.domts.JUnitTestCaseAdapter)
java.lang.ClassCastException: org.apache.html.dom.HTMLCollectionImpl
        at org.w3c.domts.level1.html.HTMLTableRowElement14.runTest(HTMLTableRowE
lement14.java:76)
        at org.w3c.domts.JUnitTestCaseAdapter.runTest(JUnitTestCaseAdapter.java:
53)
There were 40 failures:
1) http://www.w3.org/2001/DOM-Test-Suite/level1/html/HTMLAppletElement05(org.w3c
.domts.JUnitTestCaseAdapter)junit.framework.AssertionFailedError: codeBaseLink e
xpected:<xw2k.sdct.itl.nist.gov/brady/dom/files/> but was:<//xw2k.sdct.itl.nist.
gov/brady/dom/files/>
        at org.w3c.domts.JUnitTestCaseAdapter.assertURIEquals(JUnitTestCaseAdapt
er.java:285)
        at org.w3c.domts.DOMTestCase.assertURIEquals(DOMTestCase.java:254)
        at org.w3c.domts.level1.html.HTMLAppletElement05.runTest(HTMLAppletEleme
nt05.java:81)
        at org.w3c.domts.JUnitTestCaseAdapter.runTest(JUnitTestCaseAdapter.java:
53)
2) http://www.w3.org/2001/DOM-Test-Suite/level1/html/HTMLAppletElement07(org.w3c
.domts.JUnitTestCaseAdapter)junit.framework.AssertionFailedError: hspaceLink exp
ected:<0> but was:<6>
        at org.w3c.domts.JUnitTestCaseAdapter.assertEquals(JUnitTestCaseAdapter.
java:172)
        at org.w3c.domts.DOMTestCase.assertEquals(DOMTestCase.java:207)
        at org.w3c.domts.level1.html.HTMLAppletElement07.runTest(HTMLAppletEleme
nt07.java:83)
        at org.w3c.domts.JUnitTestCaseAdapter.runTest(JUnitTestCaseAdapter.java:
53)
3) http://www.w3.org/2001/DOM-Test-Suite/level1/html/HTMLAreaElement05(org.w3c.d
omts.JUnitTestCaseAdapter)junit.framework.AssertionFailedError: noHrefLink expec
ted:<false> but was:<true>
        at org.w3c.domts.JUnitTestCaseAdapter.assertFalse(JUnitTestCaseAdapter.j
ava:71)
        at org.w3c.domts.DOMTestCase.assertFalse(DOMTestCase.java:162)
        at org.w3c.domts.level1.html.HTMLAreaElement05.runTest(HTMLAreaElement05
.java:81)
        at org.w3c.domts.JUnitTestCaseAdapter.runTest(JUnitTestCaseAdapter.java:
53)
4) http://www.w3.org/2001/DOM-Test-Suite/level1/html/HTMLDocument02(org.w3c.domt
s.JUnitTestCaseAdapter)junit.framework.AssertionFailedError: referrerLink expect
ed:<> but was:<null>
        at org.w3c.domts.JUnitTestCaseAdapter.assertEquals(JUnitTestCaseAdapter.
java:172)
        at org.w3c.domts.DOMTestCase.assertEquals(DOMTestCase.java:207)
        at org.w3c.domts.level1.html.HTMLDocument02.runTest(HTMLDocument02.java:
62)
        at org.w3c.domts.JUnitTestCaseAdapter.runTest(JUnitTestCaseAdapter.java:
53)
5) http://www.w3.org/2001/DOM-Test-Suite/level1/html/HTMLDocument03(org.w3c.domt
s.JUnitTestCaseAdapter)junit.framework.AssertionFailedError: domainLink expected
:<> but was:<null>
        at org.w3c.domts.JUnitTestCaseAdapter.assertEquals(JUnitTestCaseAdapter.
java:172)
        at org.w3c.domts.DOMTestCase.assertEquals(DOMTestCase.java:207)
        at org.w3c.domts.level1.html.HTMLDocument03.runTest(HTMLDocument03.java:
62)
        at org.w3c.domts.JUnitTestCaseAdapter.runTest(JUnitTestCaseAdapter.java:
53)
6) http://www.w3.org/2001/DOM-Test-Suite/level1/html/HTMLDocument04(org.w3c.domt
s.JUnitTestCaseAdapter)junit.framework.AssertionFailedError: URLLink
        at org.w3c.domts.JUnitTestCaseAdapter.assertURIEquals(JUnitTestCaseAdapt
er.java:245)
        at org.w3c.domts.DOMTestCase.assertURIEquals(DOMTestCase.java:254)
        at org.w3c.domts.level1.html.HTMLDocument04.runTest(HTMLDocument04.java:
61)
        at org.w3c.domts.JUnitTestCaseAdapter.runTest(JUnitTestCaseAdapter.java:
53)
7) http://www.w3.org/2001/DOM-Test-Suite/level1/html/HTMLDocument07(org.w3c.domt
s.JUnitTestCaseAdapter)junit.framework.AssertionFailedError: lengthLink expected
:<1> but was:<0>
        at org.w3c.domts.JUnitTestCaseAdapter.assertEquals(JUnitTestCaseAdapter.
java:176)
        at org.w3c.domts.DOMTestCase.assertEquals(DOMTestCase.java:211)
        at org.w3c.domts.level1.html.HTMLDocument07.runTest(HTMLDocument07.java:
63)
        at org.w3c.domts.JUnitTestCaseAdapter.runTest(JUnitTestCaseAdapter.java:
53)
8) http://www.w3.org/2001/DOM-Test-Suite/level1/html/HTMLDocument08(org.w3c.domt
s.JUnitTestCaseAdapter)junit.framework.AssertionFailedError: lengthLink expected
:<2> but was:<0>
        at org.w3c.domts.JUnitTestCaseAdapter.assertEquals(JUnitTestCaseAdapter.
java:176)
        at org.w3c.domts.DOMTestCase.assertEquals(DOMTestCase.java:211)
        at org.w3c.domts.level1.html.HTMLDocument08.runTest(HTMLDocument08.java:
64)
        at org.w3c.domts.JUnitTestCaseAdapter.runTest(JUnitTestCaseAdapter.java:
53)
9) http://www.w3.org/2001/DOM-Test-Suite/level1/html/HTMLDocument09(org.w3c.domt
s.JUnitTestCaseAdapter)junit.framework.AssertionFailedError: lengthLink expected
:<3> but was:<0>
        at org.w3c.domts.JUnitTestCaseAdapter.assertEquals(JUnitTestCaseAdapter.
java:176)
        at org.w3c.domts.DOMTestCase.assertEquals(DOMTestCase.java:211)
        at org.w3c.domts.level1.html.HTMLDocument09.runTest(HTMLDocument09.java:
64)
        at org.w3c.domts.JUnitTestCaseAdapter.runTest(JUnitTestCaseAdapter.java:
53)
10) http://www.w3.org/2001/DOM-Test-Suite/level1/html/HTMLDocument10(org.w3c.dom
ts.JUnitTestCaseAdapter)junit.framework.AssertionFailedError: lengthLink expecte
d:<1> but was:<0>
        at org.w3c.domts.JUnitTestCaseAdapter.assertEquals(JUnitTestCaseAdapter.
java:176)
        at org.w3c.domts.DOMTestCase.assertEquals(DOMTestCase.java:211)
        at org.w3c.domts.level1.html.HTMLDocument10.runTest(HTMLDocument10.java:
63)
        at org.w3c.domts.JUnitTestCaseAdapter.runTest(JUnitTestCaseAdapter.java:
53)
11) http://www.w3.org/2001/DOM-Test-Suite/level1/html/HTMLDocument11(org.w3c.dom
ts.JUnitTestCaseAdapter)junit.framework.AssertionFailedError: lengthLink expecte
d:<1> but was:<0>
        at org.w3c.domts.JUnitTestCaseAdapter.assertEquals(JUnitTestCaseAdapter.
java:176)
        at org.w3c.domts.DOMTestCase.assertEquals(DOMTestCase.java:211)
        at org.w3c.domts.level1.html.HTMLDocument11.runTest(HTMLDocument11.java:
64)
        at org.w3c.domts.JUnitTestCaseAdapter.runTest(JUnitTestCaseAdapter.java:
53)
12) http://www.w3.org/2001/DOM-Test-Suite/level1/html/HTMLDocument12(org.w3c.dom
ts.JUnitTestCaseAdapter)junit.framework.AssertionFailedError: cookieLink expecte
d:<> but was:<null>
        at org.w3c.domts.JUnitTestCaseAdapter.assertEquals(JUnitTestCaseAdapter.
java:172)
        at org.w3c.domts.DOMTestCase.assertEquals(DOMTestCase.java:207)
        at org.w3c.domts.level1.html.HTMLDocument12.runTest(HTMLDocument12.java:
60)
        at org.w3c.domts.JUnitTestCaseAdapter.runTest(JUnitTestCaseAdapter.java:
53)
13) http://www.w3.org/2001/DOM-Test-Suite/level1/html/HTMLElement01(org.w3c.domt
s.JUnitTestCaseAdapter)junit.framework.AssertionFailedError: idLink expected:<Te
st-HEAD> but was:<>
        at org.w3c.domts.JUnitTestCaseAdapter.assertEquals(JUnitTestCaseAdapter.
java:172)
        at org.w3c.domts.DOMTestCase.assertEquals(DOMTestCase.java:207)
        at org.w3c.domts.level1.html.HTMLElement01.runTest(HTMLElement01.java:81
)
        at org.w3c.domts.JUnitTestCaseAdapter.runTest(JUnitTestCaseAdapter.java:
53)
14) http://www.w3.org/2001/DOM-Test-Suite/level1/html/HTMLElement30(org.w3c.domt
s.JUnitTestCaseAdapter)junit.framework.AssertionFailedError: titleLink expected:
<HEAD Element> but was:<>
        at org.w3c.domts.JUnitTestCaseAdapter.assertEquals(JUnitTestCaseAdapter.
java:172)
        at org.w3c.domts.DOMTestCase.assertEquals(DOMTestCase.java:207)
        at org.w3c.domts.level1.html.HTMLElement30.runTest(HTMLElement30.java:81
)
        at org.w3c.domts.JUnitTestCaseAdapter.runTest(JUnitTestCaseAdapter.java:
53)
15) http://www.w3.org/2001/DOM-Test-Suite/level1/html/HTMLElement59(org.w3c.domt
s.JUnitTestCaseAdapter)junit.framework.AssertionFailedError: langLink expected:<
en> but was:<>
        at org.w3c.domts.JUnitTestCaseAdapter.assertEquals(JUnitTestCaseAdapter.
java:172)
        at org.w3c.domts.DOMTestCase.assertEquals(DOMTestCase.java:207)
        at org.w3c.domts.level1.html.HTMLElement59.runTest(HTMLElement59.java:81
)
        at org.w3c.domts.JUnitTestCaseAdapter.runTest(JUnitTestCaseAdapter.java:
53)
16) http://www.w3.org/2001/DOM-Test-Suite/level1/html/HTMLElement88(org.w3c.domt
s.JUnitTestCaseAdapter)junit.framework.AssertionFailedError: dirLink expected:<l
tr> but was:<>
        at org.w3c.domts.JUnitTestCaseAdapter.assertEquals(JUnitTestCaseAdapter.
java:172)
        at org.w3c.domts.DOMTestCase.assertEquals(DOMTestCase.java:207)
        at org.w3c.domts.level1.html.HTMLElement88.runTest(HTMLElement88.java:81
)
        at org.w3c.domts.JUnitTestCaseAdapter.runTest(JUnitTestCaseAdapter.java:
53)
17) http://www.w3.org/2001/DOM-Test-Suite/level1/html/HTMLElement117(org.w3c.dom
ts.JUnitTestCaseAdapter)junit.framework.AssertionFailedError: classNameLink expe
cted:<HEAD-class> but was:<>
        at org.w3c.domts.JUnitTestCaseAdapter.assertEquals(JUnitTestCaseAdapter.
java:172)
        at org.w3c.domts.DOMTestCase.assertEquals(DOMTestCase.java:207)
        at org.w3c.domts.level1.html.HTMLElement117.runTest(HTMLElement117.java:
81)
        at org.w3c.domts.JUnitTestCaseAdapter.runTest(JUnitTestCaseAdapter.java:
53)
18) http://www.w3.org/2001/DOM-Test-Suite/level1/html/HTMLHeadingElement01(org.w
3c.domts.JUnitTestCaseAdapter)junit.framework.AssertionFailedError: alignLink ex
pected:<center> but was:<align>
        at org.w3c.domts.JUnitTestCaseAdapter.assertEquals(JUnitTestCaseAdapter.
java:172)
        at org.w3c.domts.DOMTestCase.assertEquals(DOMTestCase.java:207)
        at org.w3c.domts.level1.html.HTMLHeadingElement01.runTest(HTMLHeadingEle
ment01.java:81)
        at org.w3c.domts.JUnitTestCaseAdapter.runTest(JUnitTestCaseAdapter.java:
53)
19) http://www.w3.org/2001/DOM-Test-Suite/level1/html/HTMLHeadingElement02(org.w
3c.domts.JUnitTestCaseAdapter)junit.framework.AssertionFailedError: alignLink ex
pected:<left> but was:<align>
        at org.w3c.domts.JUnitTestCaseAdapter.assertEquals(JUnitTestCaseAdapter.
java:172)
        at org.w3c.domts.DOMTestCase.assertEquals(DOMTestCase.java:207)
        at org.w3c.domts.level1.html.HTMLHeadingElement02.runTest(HTMLHeadingEle
ment02.java:81)
        at org.w3c.domts.JUnitTestCaseAdapter.runTest(JUnitTestCaseAdapter.java:
53)
20) http://www.w3.org/2001/DOM-Test-Suite/level1/html/HTMLHeadingElement03(org.w
3c.domts.JUnitTestCaseAdapter)junit.framework.AssertionFailedError: alignLink ex
pected:<right> but was:<align>
        at org.w3c.domts.JUnitTestCaseAdapter.assertEquals(JUnitTestCaseAdapter.
java:172)
        at org.w3c.domts.DOMTestCase.assertEquals(DOMTestCase.java:207)
        at org.w3c.domts.level1.html.HTMLHeadingElement03.runTest(HTMLHeadingEle
ment03.java:81)
        at org.w3c.domts.JUnitTestCaseAdapter.runTest(JUnitTestCaseAdapter.java:
53)
21) http://www.w3.org/2001/DOM-Test-Suite/level1/html/HTMLHeadingElement04(org.w
3c.domts.JUnitTestCaseAdapter)junit.framework.AssertionFailedError: alignLink ex
pected:<justify> but was:<align>
        at org.w3c.domts.JUnitTestCaseAdapter.assertEquals(JUnitTestCaseAdapter.
java:172)
        at org.w3c.domts.DOMTestCase.assertEquals(DOMTestCase.java:207)
        at org.w3c.domts.level1.html.HTMLHeadingElement04.runTest(HTMLHeadingEle
ment04.java:81)
        at org.w3c.domts.JUnitTestCaseAdapter.runTest(JUnitTestCaseAdapter.java:
53)
22) http://www.w3.org/2001/DOM-Test-Suite/level1/html/HTMLHeadingElement05(org.w
3c.domts.JUnitTestCaseAdapter)junit.framework.AssertionFailedError: alignLink ex
pected:<center> but was:<align>
        at org.w3c.domts.JUnitTestCaseAdapter.assertEquals(JUnitTestCaseAdapter.
java:172)
        at org.w3c.domts.DOMTestCase.assertEquals(DOMTestCase.java:207)
        at org.w3c.domts.level1.html.HTMLHeadingElement05.runTest(HTMLHeadingEle
ment05.java:81)
        at org.w3c.domts.JUnitTestCaseAdapter.runTest(JUnitTestCaseAdapter.java:
53)
23) http://www.w3.org/2001/DOM-Test-Suite/level1/html/HTMLHeadingElement06(org.w
3c.domts.JUnitTestCaseAdapter)junit.framework.AssertionFailedError: alignLink ex
pected:<left> but was:<align>
        at org.w3c.domts.JUnitTestCaseAdapter.assertEquals(JUnitTestCaseAdapter.
java:172)
        at org.w3c.domts.DOMTestCase.assertEquals(DOMTestCase.java:207)
        at org.w3c.domts.level1.html.HTMLHeadingElement06.runTest(HTMLHeadingEle
ment06.java:81)
        at org.w3c.domts.JUnitTestCaseAdapter.runTest(JUnitTestCaseAdapter.java:
53)
24) http://www.w3.org/2001/DOM-Test-Suite/level1/html/HTMLHtmlElement01(org.w3c.
domts.JUnitTestCaseAdapter)junit.framework.AssertionFailedError: versionLink exp
ected:<transitional 4.0> but was:<transitional xhtml 1.0>
        at org.w3c.domts.JUnitTestCaseAdapter.assertEquals(JUnitTestCaseAdapter.
java:172)
        at org.w3c.domts.DOMTestCase.assertEquals(DOMTestCase.java:207)
        at org.w3c.domts.level1.html.HTMLHtmlElement01.runTest(HTMLHtmlElement01
.java:83)
        at org.w3c.domts.JUnitTestCaseAdapter.runTest(JUnitTestCaseAdapter.java:
53)
25) http://www.w3.org/2001/DOM-Test-Suite/level1/html/HTMLInputElement01(org.w3c
.domts.JUnitTestCaseAdapter)junit.framework.AssertionFailedError: defaultValueLi
nk expected:<EarlyMornings> but was:<>
        at org.w3c.domts.JUnitTestCaseAdapter.assertEquals(JUnitTestCaseAdapter.
java:172)
        at org.w3c.domts.DOMTestCase.assertEquals(DOMTestCase.java:207)
        at org.w3c.domts.level1.html.HTMLInputElement01.runTest(HTMLInputElement
01.java:85)
        at org.w3c.domts.JUnitTestCaseAdapter.runTest(JUnitTestCaseAdapter.java:
53)
26) http://www.w3.org/2001/DOM-Test-Suite/level1/html/HTMLInputElement02(org.w3c
.domts.JUnitTestCaseAdapter)junit.framework.AssertionFailedError: defaultChecked
Link
        at org.w3c.domts.JUnitTestCaseAdapter.assertTrue(JUnitTestCaseAdapter.ja
va:66)
        at org.w3c.domts.DOMTestCase.assertTrue(DOMTestCase.java:158)
        at org.w3c.domts.level1.html.HTMLInputElement02.runTest(HTMLInputElement
02.java:85)
        at org.w3c.domts.JUnitTestCaseAdapter.runTest(JUnitTestCaseAdapter.java:
53)
27) http://www.w3.org/2001/DOM-Test-Suite/level1/html/HTMLOptionElement03(org.w3
c.domts.JUnitTestCaseAdapter)junit.framework.AssertionFailedError: defaultSelect
edLink
        at org.w3c.domts.JUnitTestCaseAdapter.assertTrue(JUnitTestCaseAdapter.ja
va:66)
        at org.w3c.domts.DOMTestCase.assertTrue(DOMTestCase.java:158)
        at org.w3c.domts.level1.html.HTMLOptionElement03.runTest(HTMLOptionEleme
nt03.java:85)
        at org.w3c.domts.JUnitTestCaseAdapter.runTest(JUnitTestCaseAdapter.java:
53)
28) http://www.w3.org/2001/DOM-Test-Suite/level1/html/HTMLOptionElement08(org.w3
c.domts.JUnitTestCaseAdapter)junit.framework.AssertionFailedError: selectedLink
        at org.w3c.domts.JUnitTestCaseAdapter.assertTrue(JUnitTestCaseAdapter.ja
va:66)
        at org.w3c.domts.DOMTestCase.assertTrue(DOMTestCase.java:158)
        at org.w3c.domts.level1.html.HTMLOptionElement08.runTest(HTMLOptionEleme
nt08.java:85)
        at org.w3c.domts.JUnitTestCaseAdapter.runTest(JUnitTestCaseAdapter.java:
53)
29) http://www.w3.org/2001/DOM-Test-Suite/level1/html/HTMLSelectElement01(org.w3
c.domts.JUnitTestCaseAdapter)junit.framework.AssertionFailedError: typeLink expe
cted:<select-multiple> but was:<>
        at org.w3c.domts.JUnitTestCaseAdapter.assertEquals(JUnitTestCaseAdapter.
java:172)
        at org.w3c.domts.DOMTestCase.assertEquals(DOMTestCase.java:207)
        at org.w3c.domts.level1.html.HTMLSelectElement01.runTest(HTMLSelectEleme
nt01.java:85)
        at org.w3c.domts.JUnitTestCaseAdapter.runTest(JUnitTestCaseAdapter.java:
53)
30) http://www.w3.org/2001/DOM-Test-Suite/level1/html/HTMLSelectElement04(org.w3
c.domts.JUnitTestCaseAdapter)junit.framework.AssertionFailedError: valueLink exp
ected:<EMP1> but was:<>
        at org.w3c.domts.JUnitTestCaseAdapter.assertEquals(JUnitTestCaseAdapter.
java:172)
        at org.w3c.domts.DOMTestCase.assertEquals(DOMTestCase.java:207)
        at org.w3c.domts.level1.html.HTMLSelectElement04.runTest(HTMLSelectEleme
nt04.java:83)
        at org.w3c.domts.JUnitTestCaseAdapter.runTest(JUnitTestCaseAdapter.java:
53)
31) http://www.w3.org/2001/DOM-Test-Suite/level1/html/HTMLTableElement20(org.w3c
.domts.JUnitTestCaseAdapter)junit.framework.AssertionFailedError: alignLink expe
cted:<center> but was:<>
        at org.w3c.domts.JUnitTestCaseAdapter.assertEquals(JUnitTestCaseAdapter.
java:172)
        at org.w3c.domts.DOMTestCase.assertEquals(DOMTestCase.java:207)
        at org.w3c.domts.level1.html.HTMLTableElement20.runTest(HTMLTableElement
20.java:72)
        at org.w3c.domts.JUnitTestCaseAdapter.runTest(JUnitTestCaseAdapter.java:
53)
32) http://www.w3.org/2001/DOM-Test-Suite/level1/html/HTMLTableElement21(org.w3c
.domts.JUnitTestCaseAdapter)junit.framework.AssertionFailedError: vsection1Id
        at org.w3c.domts.JUnitTestCaseAdapter.assertNotNull(JUnitTestCaseAdapter
.java:80)
        at org.w3c.domts.DOMTestCase.assertNotNull(DOMTestCase.java:170)
        at org.w3c.domts.level1.html.HTMLTableElement21.runTest(HTMLTableElement
21.java:76)
        at org.w3c.domts.JUnitTestCaseAdapter.runTest(JUnitTestCaseAdapter.java:
53)
33) http://www.w3.org/2001/DOM-Test-Suite/level1/html/HTMLTableElement23(org.w3c
.domts.JUnitTestCaseAdapter)junit.framework.AssertionFailedError: alignLink expe
cted:<center> but was:<>
        at org.w3c.domts.JUnitTestCaseAdapter.assertEquals(JUnitTestCaseAdapter.
java:172)
        at org.w3c.domts.DOMTestCase.assertEquals(DOMTestCase.java:207)
        at org.w3c.domts.level1.html.HTMLTableElement23.runTest(HTMLTableElement
23.java:72)
        at org.w3c.domts.JUnitTestCaseAdapter.runTest(JUnitTestCaseAdapter.java:
53)
34) http://www.w3.org/2001/DOM-Test-Suite/level1/html/HTMLTableElement24(org.w3c
.domts.JUnitTestCaseAdapter)junit.framework.AssertionFailedError: vsection1Id
        at org.w3c.domts.JUnitTestCaseAdapter.assertNotNull(JUnitTestCaseAdapter
.java:80)
        at org.w3c.domts.DOMTestCase.assertNotNull(DOMTestCase.java:170)
        at org.w3c.domts.level1.html.HTMLTableElement24.runTest(HTMLTableElement
24.java:76)
        at org.w3c.domts.JUnitTestCaseAdapter.runTest(JUnitTestCaseAdapter.java:
53)
35) http://www.w3.org/2001/DOM-Test-Suite/level1/html/HTMLTableElement26(org.w3c
.domts.JUnitTestCaseAdapter)junit.framework.AssertionFailedError: vsection1Id
        at org.w3c.domts.JUnitTestCaseAdapter.assertNotNull(JUnitTestCaseAdapter
.java:80)
        at org.w3c.domts.DOMTestCase.assertNotNull(DOMTestCase.java:170)
        at org.w3c.domts.level1.html.HTMLTableElement26.runTest(HTMLTableElement
26.java:70)
        at org.w3c.domts.JUnitTestCaseAdapter.runTest(JUnitTestCaseAdapter.java:
53)
36) http://www.w3.org/2001/DOM-Test-Suite/level1/html/HTMLTableElement27(org.w3c
.domts.JUnitTestCaseAdapter)junit.framework.AssertionFailedError: vsection1Id
        at org.w3c.domts.JUnitTestCaseAdapter.assertNotNull(JUnitTestCaseAdapter
.java:80)
        at org.w3c.domts.DOMTestCase.assertNotNull(DOMTestCase.java:170)
        at org.w3c.domts.level1.html.HTMLTableElement27.runTest(HTMLTableElement
27.java:66)
        at org.w3c.domts.JUnitTestCaseAdapter.runTest(JUnitTestCaseAdapter.java:
53)
37) http://www.w3.org/2001/DOM-Test-Suite/level1/html/HTMLTableRowElement01(org.
w3c.domts.JUnitTestCaseAdapter)junit.framework.AssertionFailedError: rowIndexLin
k expected:<1> but was:<2>
        at org.w3c.domts.JUnitTestCaseAdapter.assertEquals(JUnitTestCaseAdapter.
java:176)
        at org.w3c.domts.DOMTestCase.assertEquals(DOMTestCase.java:211)
        at org.w3c.domts.level1.html.HTMLTableRowElement01.runTest(HTMLTableRowE
lement01.java:89)
        at org.w3c.domts.JUnitTestCaseAdapter.runTest(JUnitTestCaseAdapter.java:
53)
38) http://www.w3.org/2001/DOM-Test-Suite/level1/html/HTMLTextAreaElement01(org.
w3c.domts.JUnitTestCaseAdapter)junit.framework.AssertionFailedError: defaultValu
eLink expected:<TEXTAREA2> but was:<>
        at org.w3c.domts.JUnitTestCaseAdapter.assertEquals(JUnitTestCaseAdapter.
java:172)
        at org.w3c.domts.DOMTestCase.assertEquals(DOMTestCase.java:207)
        at org.w3c.domts.level1.html.HTMLTextAreaElement01.runTest(HTMLTextAreaE
lement01.java:85)
        at org.w3c.domts.JUnitTestCaseAdapter.runTest(JUnitTestCaseAdapter.java:
53)
39) http://www.w3.org/2001/DOM-Test-Suite/level1/html/HTMLTextAreaElement11(org.
w3c.domts.JUnitTestCaseAdapter)junit.framework.AssertionFailedError: typeLink ex
pected:<textarea> but was:<>
        at org.w3c.domts.JUnitTestCaseAdapter.assertEquals(JUnitTestCaseAdapter.
java:172)
        at org.w3c.domts.DOMTestCase.assertEquals(DOMTestCase.java:207)
        at org.w3c.domts.level1.html.HTMLTextAreaElement11.runTest(HTMLTextAreaE
lement11.java:83)
        at org.w3c.domts.JUnitTestCaseAdapter.runTest(JUnitTestCaseAdapter.java:
53)
40) http://www.w3.org/2001/DOM-Test-Suite/level1/html/HTMLTextAreaElement12(org.
w3c.domts.JUnitTestCaseAdapter)junit.framework.AssertionFailedError: valueLink e
xpected:<TEXTAREA1> but was:<>
        at org.w3c.domts.JUnitTestCaseAdapter.assertEquals(JUnitTestCaseAdapter.
java:172)
        at org.w3c.domts.DOMTestCase.assertEquals(DOMTestCase.java:207)
        at org.w3c.domts.level1.html.HTMLTextAreaElement12.runTest(HTMLTextAreaE
lement12.java:85)
        at org.w3c.domts.JUnitTestCaseAdapter.runTest(JUnitTestCaseAdapter.java:
53)

FAILURES!!!
Tests run: 517,  Failures: 40,  Errors: 49





Received on Tuesday, 4 June 2002 22:05:29 UTC

This archive was generated by hypermail 2.3.1 : Tuesday, 6 January 2015 20:34:05 UTC