W3C home > Mailing lists > Public > www-dom-ts@w3.org > February 2002

Error in jsunit-init task

From: Dimitris Dimitriadis <dimitris@ontologicon.com>
Date: Thu, 14 Feb 2002 01:06:00 +0100
To: www-dom-ts@w3.org
Message-Id: <A0F908A2-20DE-11D6-9D3C-000393556882@ontologicon.com>
When trying to build the TS for release, I did some minor updates 
(index.htm, test-to-matrix.xml and COPYRIGHT.html), after which I did a 
fresh checkout and tried to build.

I then ran into the following (haven't seen it before):

     [unzip] Expanding: /Users/dimitris/2001/DOM-Test-
Suite/lib/jsunit.zip into /Users/dimitris/2001/DOM-Test-Suite/lib
     [patch] patching file /Users/dimitris/2001/DOM-Test-
     [patch] Hunk #1 FAILED at 46.
     [patch] Hunk #2 FAILED at 274.
     [patch] Hunk #3 FAILED at 280.
     [patch] 3 out of 3 hunks FAILED -- saving rejects to file 
     [patch] patching file /Users/dimitris/2001/DOM-Test-
     [patch] Reversed (or previously applied) patch detected!  Assume -R? 
     [patch] Apply anyway? [n]
     [patch] Skipping patch.
     [patch] 3 out of 3 hunks ignored -- saving rejects to file 
     [patch] patching file /Users/dimitris/2001/DOM-Test-

I don't know what to make of this.


Received on Wednesday, 13 February 2002 19:05:07 UTC

This archive was generated by hypermail 2.3.1 : Tuesday, 6 January 2015 20:34:04 UTC